program: Orca
programVersion: 5.0.2
elementType: Cl S F O O O O O N N N N N C C C C C C C C C C C C C C C H H H H H H H H H H H H H
charge: 0
multiplicity: 1
keywords: wb97x-d3
keywords: def2-TZVPP
keywords: def2/J RIJCOSX
keywords: DEFGRID2
keywords: scfconv7
keywords: smallprint printgap noloewdin
keywords: NOSOSCF
formula: C15H13ClFN5O5S
InChI: InChI=1/C15H13ClFN5O5S/c1-3-27-15-18-10(17)7-11-19-14(20-22(11)15)28(24,25)21-12-8(13(23)26-2)5-4-6-9(12)16/h4-7,21H,3H2,1-2H3
41 atoms
Cl 0.746638 2.125952 0.668939
S  0.441023 -1.773313 0.84396
F  -4.067901 2.402826 -3.093676
O  -4.152156 0.99093 1.201725
O  0.957221 -2.666205 -0.170682
O  -0.053438 -2.260961 2.110845
O  3.897588 -2.325074 0.954659
O  3.989662 -2.8635 -1.209422
N  -2.484536 0.338327 -0.142838
N  1.620527 -0.670405 1.188064
N  -1.853397 -0.394852 0.781928
N  -0.740699 -0.453063 -1.197964
N  -4.121098 1.726241 -0.9745
C  -0.84078 -0.81905 0.079106
C  -1.808424 0.307496 -1.335525
C  2.303476 -0.020866 0.13841
C  3.285138 -0.683087 -0.603264
C  -3.634237 1.054839 0.017322
C  1.992549 1.297678 -0.195739
C  -2.330832 1.02768 -2.41781
C  3.903035 -0.033923 -1.666006
C  2.646744 1.960023 -1.218789
C  -3.480515 1.696421 -2.142702
C  3.599932 1.283819 -1.959901
C  3.733948 -2.079454 -0.327303
C  -5.369944 1.731472 1.46808
C  -5.785701 1.422576 2.878867
C  4.343259 -3.633494 1.322638
H  1.409264 -0.107284 2.008409
H  -1.844906 1.03879 -3.381138
H  4.649937 -0.5534 -2.250122
H  2.398006 2.987212 -1.44678
H  4.105096 1.788724 -2.77136
H  -5.167025 2.793625 1.332327
H  -6.132876 1.426115 0.752648
H  -6.702438 1.970147 3.09384
H  -5.991522 0.361917 3.015985
H  -5.03337 1.734475 3.602196
H  3.614336 -4.391705 1.037224
H  4.442651 -3.618791 2.403554
H  5.30857 -3.865827 0.874251
elementType: Cl S F O N C H
totalener: -2187.70412148 hartree
nucrepener: 3169.46130933 hartree
electener: -5357.16543081 hartree
oneelecener: -9309.04468669 hartree
twoeener: 3951.87925588 hartree
cpcmener: -0.05489690 hartree
kineticenergy: 2181.07145881 hartree
xcener: -161.670621904127 hartree
chargesum: 0.0000000
charge: -0.068133 0.878919 -0.177344 -0.265053 -0.497837 -0.506686 -0.259967 -0.471984 0.174615 -0.200369 -0.291429 -0.336661 -0.369777 0.077064 0.207629 0.127387 0.012739 0.462978 -0.011200 -0.275750 -0.142034 -0.076927 0.373160 -0.157405 0.448147 0.043159 -0.246596 -0.128163 0.187013 0.159827 0.147748 0.146974 0.165336 0.112739 0.108315 0.093314 0.091766 0.091804 0.120932 0.129831 0.121919
qa: -0.0681 0.8789 -0.1773 -0.2651 -0.4978 -0.5067 -0.2600 -0.4720 0.1746 -0.2004 -0.2914 -0.3367 -0.3698 0.0771 0.2076 0.1274 0.0127 0.4630 -0.0112 -0.2758 -0.1420 -0.0769 0.3732 -0.1574 0.4481 0.0432 -0.2466 -0.1282 0.1870 0.1598 0.1477 0.1470 0.1653 0.1127 0.1083 0.0933 0.0918 0.0918 0.1209 0.1298 0.1219
va: 1.2633 5.7925 1.1200 2.2046 1.9986 1.9998 2.1299 2.0234 3.3987 3.1036 2.9017 3.0617 3.0189 4.2278 4.0224 3.7611 3.7784 4.1642 4.0007 3.9016 3.9806 3.9368 4.2155 3.9520 4.1367 3.8034 3.9671 3.8564 1.0282 1.0056 1.0110 1.0015 0.9874 0.9968 0.9977 1.0056 1.0034 1.0032 0.9942 0.9953 0.9947
dispcorr: -0.023295382 hartree
energy: -2187.727416857036
dipole: -0.85992 -0.26657 -1.12649 -3.26504 6.89164 3.62661 10.44086 -9.93518 0.50567
magnitude: 3.83105 au
magnitude: 9.73776 debye
