program: Orca
programVersion: 5.0.2
elementType: Cl S F O O O O O N N N N N C C C C C C C C C C C C C C C H H H H H H H H H H H H H
charge: 0
multiplicity: 1
keywords: wb97x-d3
keywords: def2-TZVPP
keywords: def2/J RIJCOSX
keywords: DEFGRID2
keywords: scfconv7
keywords: smallprint printgap noloewdin
keywords: NOSOSCF
formula: C15H13ClFN5O5S
InChI: InChI=1/C15H13ClFN5O5S/c1-3-27-15-18-10(17)7-11-19-14(20-22(11)15)28(24,25)21-12-8(13(23)26-2)5-4-6-9(12)16/h4-7,21H,3H2,1-2H3
41 atoms
Cl 0.111808 -0.786904 -2.315449
S  0.701225 -0.821512 1.550453
F  -3.872923 3.850761 -1.701201
O  -4.43256 -0.241434 0.145222
O  0.089044 -1.92041 2.262667
O  1.633575 0.086039 2.184354
O  4.014836 -1.809374 1.367947
O  4.778921 0.265574 1.672449
N  -2.413822 0.718699 0.176456
N  1.455609 -1.471026 0.24077
N  -1.807679 -0.295263 0.804437
N  -0.341903 1.387211 0.377341
N  -4.171143 1.838756 -0.799671
C  -0.59594 0.178391 0.877607
C  -1.527356 1.730618 -0.086859
C  2.214413 -0.657047 -0.623819
C  3.482097 -0.197225 -0.255889
C  -3.727478 0.792945 -0.182475
C  1.696565 -0.273161 -1.861079
C  -1.999035 2.870861 -0.752289
C  4.184051 0.647563 -1.108603
C  2.419613 0.523515 -2.731329
C  -3.320563 2.830144 -1.06635
C  3.665133 0.988742 -2.345384
C  4.143063 -0.541791 1.037671
C  -5.838781 -0.27313 -0.204573
C  -6.400255 -1.562549 0.329335
C  4.58374 -2.223273 2.614778
H  0.961704 -2.259777 -0.16923
H  -1.35051 3.699718 -0.990669
H  5.156789 1.018673 -0.816163
H  2.004322 0.794104 -3.692202
H  4.229813 1.623683 -3.013775
H  -6.332504 0.591938 0.238959
H  -5.929945 -0.212714 -1.289415
H  -6.327174 -1.615806 1.415337
H  -7.455252 -1.617272 0.062616
H  -5.901321 -2.430079 -0.102172
H  4.153197 -1.667652 3.448206
H  5.667383 -2.104302 2.615518
H  4.336532 -3.276015 2.718718
elementType: Cl S F O N C H
totalener: -2187.70405047 hartree
nucrepener: 3162.42506211 hartree
electener: -5350.12911258 hartree
oneelecener: -9295.06987315 hartree
twoeener: 3944.94076058 hartree
cpcmener: -0.05501295 hartree
kineticenergy: 2181.05216757 hartree
xcener: -161.667864120433 hartree
chargesum: 0.0000000
charge: -0.066381 0.875038 -0.177675 -0.263899 -0.508331 -0.499739 -0.262632 -0.470977 0.176003 -0.206762 -0.292418 -0.338654 -0.370012 0.088006 0.207286 0.130544 0.022455 0.462091 -0.020168 -0.278349 -0.136482 -0.079659 0.373731 -0.158221 0.443977 0.040316 -0.247184 -0.128349 0.189728 0.160646 0.147151 0.149269 0.165208 0.110034 0.112931 0.092337 0.093504 0.091536 0.119542 0.124627 0.129933
qa: -0.0664 0.8750 -0.1777 -0.2639 -0.5083 -0.4997 -0.2626 -0.4710 0.1760 -0.2068 -0.2924 -0.3387 -0.3700 0.0880 0.2073 0.1305 0.0225 0.4621 -0.0202 -0.2783 -0.1365 -0.0797 0.3737 -0.1582 0.4440 0.0403 -0.2472 -0.1283 0.1897 0.1606 0.1472 0.1493 0.1652 0.1100 0.1129 0.0923 0.0935 0.0915 0.1195 0.1246 0.1299
va: 1.2635 5.7965 1.1193 2.2047 1.9981 1.9972 2.1310 2.0235 3.3970 3.1087 2.9015 3.0677 3.0196 4.2300 4.0234 3.7700 3.7646 4.1666 4.0120 3.9017 3.9785 3.9358 4.2132 3.9513 4.1465 3.8047 3.9670 3.8560 1.0237 1.0053 1.0114 1.0007 0.9875 0.9969 0.9964 1.0030 1.0056 1.0032 0.9954 0.9937 0.9953
dispcorr: -0.023161716 hartree
energy: -2187.727212186011
dipole: -2.36873 0.27709 -2.09163 -10.50297 10.06388 -0.43909 5.32667 -8.40386 -3.07718
magnitude: 3.74657 au
magnitude: 9.52302 debye
