program: Orca
programVersion: 5.0.2
elementType: Cl S F O O O O O N N N N N C C C C C C C C C C C C C C C H H H H H H H H H H H H H
charge: 0
multiplicity: 1
keywords: wb97x-d3
keywords: def2-TZVPP
keywords: def2/J RIJCOSX
keywords: DEFGRID2
keywords: scfconv7
keywords: smallprint printgap noloewdin
keywords: NOSOSCF
formula: C15H13ClFN5O5S
InChI: InChI=1/C15H13ClFN5O5S/c1-3-27-15-18-10(17)7-11-19-14(20-22(11)15)28(24,25)21-12-8(13(23)26-2)5-4-6-9(12)16/h4-7,21H,3H2,1-2H3
41 atoms
Cl 4.678518 0.70491 1.712482
S  1.091054 0.884147 1.873119
F  -4.111048 0.84993 -3.275295
O  -4.025693 -0.568097 1.011505
O  0.650786 0.591517 3.216632
O  1.82379 2.080092 1.532464
O  0.377799 -1.406559 -2.357095
O  0.343296 -2.025001 -0.218502
N  -2.209863 0.42163 0.144236
N  1.979836 -0.41262 1.370869
N  -1.459291 0.30926 1.248163
N  -0.299131 1.31888 -0.417032
N  -4.080451 0.155318 -1.164134
C  -0.349945 0.860085 0.837611
C  -1.507526 1.035266 -0.865478
C  2.719019 -0.344575 0.16967
C  2.222913 -0.811563 -1.058364
C  -3.491437 -0.007111 -0.024842
C  4.002557 0.1978 0.212361
C  -2.141412 1.219346 -2.103599
C  3.009624 -0.711422 -2.201594
C  4.777143 0.301033 -0.932606
C  -3.415071 0.746352 -2.154772
C  4.27499 -0.153444 -2.137923
C  0.888657 -1.470251 -1.143462
C  -5.389558 -1.048096 0.908279
C  -5.749043 -1.671117 2.229043
C  -0.840062 -2.113675 -2.602496
H  1.534478 -1.303991 1.571938
H  -1.640542 1.691888 -2.934796
H  2.643795 -1.079333 -3.149386
H  5.770841 0.724256 -0.877224
H  4.879837 -0.081892 -3.031452
H  -6.04088 -0.20597 0.670527
H  -5.447704 -1.772089 0.094514
H  -5.699091 -0.949069 3.044084
H  -6.77397 -2.037918 2.171075
H  -5.104586 -2.517341 2.466567
H  -0.693439 -3.190335 -2.500344
H  -1.115545 -1.882648 -3.628624
H  -1.639784 -1.794313 -1.933343
elementType: Cl S F O N C H
totalener: -2187.70401570 hartree
nucrepener: 3210.91527419 hartree
electener: -5398.61928989 hartree
oneelecener: -9391.66298490 hartree
twoeener: 3993.04369501 hartree
cpcmener: -0.04593161 hartree
kineticenergy: 2181.01813823 hartree
xcener: -161.662092430039 hartree
chargesum: 0.0000000
charge: -0.056821 0.856718 -0.176250 -0.258462 -0.492635 -0.477732 -0.272044 -0.436517 0.186571 -0.211633 -0.293034 -0.331933 -0.372361 0.076188 0.186057 0.112272 -0.008887 0.458841 0.021866 -0.279490 -0.163274 -0.095395 0.377844 -0.144457 0.460191 0.039681 -0.244709 -0.134670 0.193635 0.154766 0.148023 0.142614 0.161379 0.110283 0.108136 0.092295 0.091896 0.091933 0.142144 0.134605 0.102368
qa: -0.0568 0.8567 -0.1762 -0.2585 -0.4926 -0.4777 -0.2720 -0.4365 0.1866 -0.2116 -0.2930 -0.3319 -0.3724 0.0762 0.1861 0.1123 -0.0089 0.4588 0.0219 -0.2795 -0.1633 -0.0954 0.3778 -0.1445 0.4602 0.0397 -0.2447 -0.1347 0.1936 0.1548 0.1480 0.1426 0.1614 0.1103 0.1081 0.0923 0.0919 0.0919 0.1421 0.1346 0.1024
va: 1.2629 5.8643 1.1219 2.2136 2.0150 2.0183 2.1139 2.0531 3.3924 3.0473 2.8936 3.0601 2.9968 4.1884 3.9974 3.8307 3.6723 4.1542 4.0397 3.8677 3.9898 3.9772 4.2023 3.9412 4.0811 3.8077 3.9669 3.8466 1.0334 1.0094 1.0184 1.0069 0.9895 0.9971 0.9975 1.0034 1.0055 1.0036 0.9959 0.9914 0.9935
dispcorr: -0.025181997 hartree
energy: -2187.729197696354
dipole: -20.51893 18.50259 -2.01634 -15.53650 13.43920 -2.09730 -6.51131 3.00193 -3.50938
magnitude: 4.55851 au
magnitude: 11.58682 debye
