program: Orca
programVersion: 5.0.2
elementType: Cl S F O O O O O N N N N N C C C C C C C C C C C C C C C H H H H H H H H H H H H H
charge: 0
multiplicity: 1
keywords: wb97x-d3
keywords: def2-TZVPP
keywords: def2/J RIJCOSX
keywords: DEFGRID2
keywords: scfconv7
keywords: smallprint printgap noloewdin
keywords: NOSOSCF
formula: C15H13ClFN5O5S
InChI: InChI=1/C15H13ClFN5O5S/c1-3-27-15-18-10(17)7-11-19-14(20-22(11)15)28(24,25)21-12-8(13(23)26-2)5-4-6-9(12)16/h4-7,21H,3H2,1-2H3
41 atoms
Cl 4.766187 1.192617 1.197659
S  1.192456 1.208878 1.717794
F  -4.288154 -3.181818 -0.361633
O  -3.921389 1.299235 0.089997
O  1.984898 0.322735 2.536793
O  0.78582 2.522102 2.159571
O  0.181285 -1.36766 -2.261562
O  0.221249 0.812497 -1.808673
N  -2.181339 -0.007938 0.62114
N  1.981519 1.408408 0.280701
N  -1.373324 0.997351 0.980651
N  -0.308351 -0.99598 1.160708
N  -4.118898 -0.977243 -0.144038
C  -0.29116 0.334655 1.285898
C  -1.538985 -1.217976 0.736404
C  2.682101 0.324656 -0.29294
C  2.111424 -0.533764 -1.246463
C  -3.461995 0.091508 0.168253
C  4.00125 0.107439 0.101547
C  -2.246267 -2.381628 0.399144
C  2.857098 -1.592946 -1.753735
C  4.737561 -0.95062 -0.407797
C  -3.521235 -2.159689 -0.018624
C  4.158753 -1.801931 -1.330641
C  0.745248 -0.276514 -1.783987
C  -5.251052 1.511015 -0.446379
C  -5.260103 1.464094 -1.953508
C  -1.076822 -1.228522 -2.92561
H  1.481914 2.010432 -0.368634
H  -1.799865 -3.361522 0.473389
H  2.431283 -2.254559 -2.494472
H  5.76055 -1.100589 -0.090502
H  4.732651 -2.625188 -1.733426
H  -5.937968 0.785939 -0.010081
H  -5.51929 2.500016 -0.082571
H  -4.565984 2.188408 -2.379415
H  -5.020005 0.474771 -2.341418
H  -6.262007 1.720332 -2.299907
H  -0.974482 -0.634947 -3.834305
H  -1.82944 -0.773753 -2.283173
H  -1.386976 -2.236072 -3.186111
elementType: Cl S F O N C H
totalener: -2187.70249386 hartree
nucrepener: 3226.23734054 hartree
electener: -5413.93983439 hartree
oneelecener: -9422.16436655 hartree
twoeener: 4008.22453216 hartree
cpcmener: -0.04640452 hartree
kineticenergy: 2181.02126996 hartree
xcener: -161.662892942848 hartree
chargesum: 0.0000000
charge: -0.056569 0.857556 -0.177123 -0.264240 -0.478922 -0.492022 -0.271042 -0.437146 0.186396 -0.216802 -0.295427 -0.329351 -0.371845 0.075785 0.184927 0.114459 -0.013853 0.456291 0.022791 -0.276105 -0.164967 -0.095455 0.371107 -0.144083 0.465562 0.053554 -0.260753 -0.128517 0.194359 0.155325 0.149074 0.142915 0.161909 0.100891 0.120512 0.094429 0.091844 0.100519 0.141927 0.097181 0.134908
qa: -0.0566 0.8576 -0.1771 -0.2642 -0.4789 -0.4920 -0.2710 -0.4371 0.1864 -0.2168 -0.2954 -0.3294 -0.3718 0.0758 0.1849 0.1145 -0.0139 0.4563 0.0228 -0.2761 -0.1650 -0.0955 0.3711 -0.1441 0.4656 0.0536 -0.2608 -0.1285 0.1944 0.1553 0.1491 0.1429 0.1619 0.1009 0.1205 0.0944 0.0918 0.1005 0.1419 0.0972 0.1349
va: 1.2631 5.8615 1.1215 2.2107 2.0188 2.0147 2.1171 2.0543 3.3922 3.0404 2.8922 3.0671 2.9814 4.1877 4.0042 3.8267 3.6816 4.1505 4.0430 3.8732 3.9925 3.9783 4.2027 3.9422 4.0754 3.8115 3.9312 3.8520 1.0336 1.0088 1.0178 1.0068 0.9894 1.0093 0.9924 1.0041 1.0086 1.0067 0.9962 0.9903 0.9916
dispcorr: -0.025888836 hartree
energy: -2187.728382691465
dipole: -20.09461 17.86347 -2.23114 -1.28806 -0.77478 -2.06284 -20.84174 17.18118 -3.66056
magnitude: 4.75741 au
magnitude: 12.09238 debye
