program: Orca
programVersion: 5.0.2
elementType: Cl S F O O O O O N N N N N C C C C C C C C C C C C C C C H H H H H H H H H H H H H
charge: 0
multiplicity: 1
keywords: wb97x-d3
keywords: def2-TZVPP
keywords: def2/J RIJCOSX
keywords: DEFGRID2
keywords: scfconv7
keywords: smallprint printgap noloewdin
keywords: NOSOSCF
formula: C15H13ClFN5O5S
InChI: InChI=1/C15H13ClFN5O5S/c1-3-27-15-18-10(17)7-11-19-14(20-22(11)15)28(24,25)21-12-8(13(23)26-2)5-4-6-9(12)16/h4-7,21H,3H2,1-2H3
41 atoms
Cl 4.753695 0.874874 1.316502
S  1.186427 1.180414 1.80471
F  -3.958481 -3.173111 -1.022502
O  -4.025729 1.096353 0.472161
O  1.967103 0.278033 2.616133
O  0.750013 2.472391 2.279827
O  0.044994 -0.886898 -2.468377
O  0.21333 1.207527 -1.730315
N  -2.142982 -0.101807 0.6377
N  2.008432 1.448094 0.393529
N  -1.407929 0.89175 1.15611
N  -0.168471 -0.991595 0.917164
N  -4.008329 -1.073481 -0.287267
C  -0.259392 0.288664 1.293112
C  -1.390245 -1.241961 0.486932
C  2.625355 0.368598 -0.27881
C  2.003262 -0.325541 -1.331037
C  -3.447407 -0.040378 0.251471
C  3.907252 -0.015614 0.110174
C  -1.993611 -2.368471 -0.089799
C  2.661296 -1.388507 -1.9401
C  4.550647 -1.085044 -0.494222
C  -3.292691 -2.184911 -0.446798
C  3.921375 -1.772031 -1.515155
C  0.668041 0.092829 -1.843482
C  -5.383143 1.299783 0.007673
C  -5.421004 1.631129 -1.462711
C  -1.194849 -0.585269 -3.112466
H  1.531677 2.116676 -0.207338
H  -1.451031 -3.288863 -0.242233
H  2.196029 -1.921951 -2.756466
H  5.543875 -1.369171 -0.174328
H  4.423975 -2.601664 -1.993086
H  -5.985075 0.423376 0.247184
H  -5.737543 2.134178 0.608292
H  -6.450384 1.862351 -1.738945
H  -4.811476 2.505614 -1.690047
H  -5.090976 0.799684 -2.084846
H  -1.928268 -0.179237 -2.416339
H  -1.55902 -1.527383 -3.5120
H  -1.047944 0.120607 -3.930646
elementType: Cl S F O N C H
totalener: -2187.70211172 hartree
nucrepener: 3242.06727763 hartree
electener: -5429.76938936 hartree
oneelecener: -9453.71298106 hartree
twoeener: 4023.94359170 hartree
cpcmener: -0.04549852 hartree
kineticenergy: 2181.02697087 hartree
xcener: -161.665001666235 hartree
chargesum: -0.0000000
charge: -0.056329 0.861119 -0.177278 -0.263238 -0.476644 -0.493865 -0.271536 -0.437490 0.184216 -0.211641 -0.289288 -0.334613 -0.369733 0.075178 0.181916 0.121196 -0.018076 0.452281 0.011662 -0.268862 -0.160113 -0.092850 0.371586 -0.147474 0.465943 0.052412 -0.258248 -0.139771 0.193963 0.155063 0.147748 0.140554 0.160476 0.100925 0.120679 0.100524 0.094827 0.090298 0.104643 0.136061 0.143778
qa: -0.0563 0.8611 -0.1773 -0.2632 -0.4766 -0.4939 -0.2715 -0.4375 0.1842 -0.2116 -0.2893 -0.3346 -0.3697 0.0752 0.1819 0.1212 -0.0181 0.4523 0.0117 -0.2689 -0.1601 -0.0928 0.3716 -0.1475 0.4659 0.0524 -0.2582 -0.1398 0.1940 0.1551 0.1477 0.1406 0.1605 0.1009 0.1207 0.1005 0.0948 0.0903 0.1046 0.1361 0.1438
va: 1.2626 5.8554 1.1214 2.2113 2.0201 2.0138 2.1144 2.0536 3.3962 3.0459 2.8959 3.0570 2.9827 4.1837 4.0044 3.8145 3.6740 4.1573 4.0466 3.8639 3.9906 3.9725 4.1984 3.9454 4.0478 3.8130 3.9324 3.8557 1.0375 1.0092 1.0196 1.0078 0.9899 1.0091 0.9922 1.0071 1.0041 1.0083 0.9870 0.9889 0.9965
dispcorr: -0.026351535 hartree
energy: -2187.728463258313
dipole: -21.65365 19.25246 -2.40119 1.18756 -3.09583 -1.90827 -19.47064 15.73409 -3.73655
magnitude: 4.83415 au
magnitude: 12.28743 debye
