program: Orca
programVersion: 5.0.2
elementType: Cl S F O O O O O N N N N N C C C C C C C C C C C C C C C H H H H H H H H H H H H H
charge: 0
multiplicity: 1
keywords: wb97x-d3
keywords: def2-TZVPP
keywords: def2/J RIJCOSX
keywords: DEFGRID2
keywords: scfconv7
keywords: smallprint printgap noloewdin
keywords: NOSOSCF
formula: C15H13ClFN5O5S
InChI: InChI=1/C15H13ClFN5O5S/c1-3-27-15-18-10(17)7-11-19-14(20-22(11)15)28(24,25)21-12-8(13(23)26-2)5-4-6-9(12)16/h4-7,21H,3H2,1-2H3
41 atoms
Cl 1.167003 2.48055 -0.133449
S  0.526867 -1.289603 1.051329
F  -4.405355 2.132435 -3.126717
O  -4.292349 1.108654 1.27336
O  0.960033 -2.325876 0.139798
O  0.127631 -1.555548 2.412393
O  3.876508 -3.060515 -0.590476
O  3.873843 -2.108633 1.429567
N  -2.583696 0.501464 -0.04395
N  1.726259 -0.168158 1.107989
N  -1.8625 -0.064598 0.932601
N  -0.803516 -0.246657 -1.063942
N  -4.36236 1.632232 -0.959391
C  -0.831101 -0.480322 0.250433
C  -1.939433 0.393769 -1.253481
C  2.502112 0.133469 -0.026264
C  3.445016 -0.778919 -0.507405
C  -3.795897 1.109582 0.07797
C  2.332014 1.340453 -0.702338
C  -2.553132 0.949919 -2.385576
C  4.165957 -0.486146 -1.658361
C  3.080774 1.649301 -1.824694
C  -3.7463 1.551297 -2.137587
C  3.991929 0.725695 -2.305098
C  3.738374 -2.040797 0.235832
C  -5.594902 1.709317 1.479354
C  -5.957094 1.514741 2.926112
C  4.187436 -4.332205 -0.019969
H  1.610941 0.54578 1.820616
H  -2.09419 0.902417 -3.361113
H  4.88874 -1.193345 -2.040922
H  2.939793 2.595808 -2.328126
H  4.570038 0.955304 -3.189375
H  -5.539969 2.766472 1.217398
H  -6.31492 1.225022 0.8186
H  -6.938824 1.955353 3.098583
H  -6.015067 0.459042 3.1902
H  -5.248959 2.006845 3.592506
H  3.411044 -4.655452 0.672462
H  5.149113 -4.315648 0.492368
H  4.235871 -5.027145 -0.853508
elementType: Cl S F O N C H
totalener: -2187.70401974 hartree
nucrepener: 3128.78047048 hartree
electener: -5316.48449022 hartree
oneelecener: -9228.17197284 hartree
twoeener: 3911.68748262 hartree
cpcmener: -0.04650833 hartree
kineticenergy: 2181.05007522 hartree
xcener: -161.667169677601 hartree
chargesum: -0.0000000
charge: -0.068960 0.862261 -0.176583 -0.259164 -0.488042 -0.489801 -0.272600 -0.423240 0.169230 -0.209766 -0.298443 -0.348073 -0.369778 0.117907 0.210084 0.137027 0.013808 0.454348 -0.010643 -0.281237 -0.155493 -0.092414 0.371266 -0.153764 0.430723 0.040197 -0.244391 -0.122541 0.188824 0.157248 0.146765 0.145611 0.160649 0.109720 0.108457 0.092138 0.091497 0.092374 0.116903 0.119696 0.128201
qa: -0.0690 0.8623 -0.1766 -0.2592 -0.4880 -0.4898 -0.2726 -0.4232 0.1692 -0.2098 -0.2984 -0.3481 -0.3698 0.1179 0.2101 0.1370 0.0138 0.4543 -0.0106 -0.2812 -0.1555 -0.0924 0.3713 -0.1538 0.4307 0.0402 -0.2444 -0.1225 0.1888 0.1572 0.1468 0.1456 0.1606 0.1097 0.1085 0.0921 0.0915 0.0924 0.1169 0.1197 0.1282
va: 1.2552 5.8349 1.1206 2.2086 2.0064 2.0231 2.1171 2.0792 3.3944 3.1082 2.9064 3.0782 3.0181 4.1861 4.0251 3.7691 3.7187 4.1735 4.0132 3.9000 4.0191 3.9386 4.2144 3.9478 4.1681 3.8077 3.9660 3.8585 1.0225 1.0071 1.0136 1.0023 0.9890 0.9971 0.9979 1.0054 1.0039 1.0033 0.9960 0.9934 0.9942
dispcorr: -0.022321239 hartree
energy: -2187.726340975859
dipole: -1.74266 0.75220 -0.99046 -7.44050 9.59632 2.15582 7.15159 -8.87515 -1.72356
magnitude: 2.93244 au
magnitude: 7.45367 debye
