program: Orca
programVersion: 5.0.2
elementType: Cl S F O O O O O N N N N N C C C C C C C C C C C C C C C H H H H H H H H H H H H H
charge: 0
multiplicity: 1
keywords: wb97x-d3
keywords: def2-TZVPP
keywords: def2/J RIJCOSX
keywords: DEFGRID2
keywords: scfconv7
keywords: smallprint printgap noloewdin
keywords: NOSOSCF
formula: C15H13ClFN5O5S
InChI: InChI=1/C15H13ClFN5O5S/c1-3-27-15-18-10(17)7-11-19-14(20-22(11)15)28(24,25)21-12-8(13(23)26-2)5-4-6-9(12)16/h4-7,21H,3H2,1-2H3
41 atoms
Cl -0.090797 -0.884244 -2.201571
S  0.657041 -1.039588 1.645733
F  -3.636976 3.890642 -1.61744
O  -4.420237 -0.240857 0.039004
O  0.018873 -2.140185 2.327587
O  1.628357 -0.184665 2.289931
O  4.632055 0.123466 1.639001
O  4.110968 -2.019165 1.275375
N  -2.37512 0.655923 0.235331
N  1.365101 -1.656557 0.289526
N  -1.829267 -0.398531 0.85474
N  -0.297406 1.24747 0.560091
N  -4.035536 1.858692 -0.803779
C  -0.60623 0.029355 1.011244
C  -1.446164 1.653104 0.055317
C  2.072457 -0.80155 -0.580084
C  3.345887 -0.341843 -0.238609
C  -3.660131 0.779547 -0.199244
C  1.502227 -0.366236 -1.776131
C  -1.847805 2.829746 -0.593606
C  4.007504 0.550655 -1.073121
C  2.181276 0.48309 -2.631862
C  -3.148756 2.835752 -0.986046
C  3.433886 0.946753 -2.269731
C  4.044837 -0.855389 0.977047
C  -5.797458 -0.190357 -0.408156
C  -6.463381 -1.462347 0.039238
C  5.387211 -0.229489 2.799404
H  0.8549 -2.431092 -0.126652
H  -1.163515 3.646268 -0.765667
H  4.989684 0.916355 -0.806949
H  1.726715 0.794719 -3.562338
H  3.963742 1.62265 -2.926516
H  -6.278831 0.686639 0.025734
H  -5.80915 -0.090699 -1.494198
H  -7.501982 -1.442722 -0.290681
H  -5.991823 -2.343137 -0.395881
H  -6.460322 -1.559974 1.124646
H  4.764629 -0.730737 3.540343
H  5.752859 0.70646 3.21226
H  6.23404 -0.866722 2.544192
elementType: Cl S F O N C H
totalener: -2187.70305520 hartree
nucrepener: 3171.57223885 hartree
electener: -5359.27529405 hartree
oneelecener: -9313.48622779 hartree
twoeener: 3954.21093374 hartree
cpcmener: -0.04643399 hartree
kineticenergy: 2181.04213334 hartree
xcener: -161.663919938502 hartree
chargesum: -0.0000000
charge: -0.069439 0.868833 -0.176498 -0.258615 -0.490061 -0.483843 -0.272403 -0.423314 0.171687 -0.199055 -0.288968 -0.330555 -0.368467 0.072203 0.197612 0.128730 0.003708 0.455444 -0.005712 -0.276784 -0.152385 -0.083777 0.368907 -0.153479 0.434485 0.040304 -0.243483 -0.122874 0.186245 0.158202 0.147697 0.145413 0.161626 0.107414 0.110718 0.091856 0.091366 0.091633 0.117341 0.127945 0.120342
qa: -0.0694 0.8688 -0.1765 -0.2586 -0.4901 -0.4838 -0.2724 -0.4233 0.1717 -0.1991 -0.2890 -0.3306 -0.3685 0.0722 0.1976 0.1287 0.0037 0.4554 -0.0057 -0.2768 -0.1524 -0.0838 0.3689 -0.1535 0.4345 0.0403 -0.2435 -0.1229 0.1862 0.1582 0.1477 0.1454 0.1616 0.1074 0.1107 0.0919 0.0914 0.0916 0.1173 0.1279 0.1203
va: 1.2626 5.8286 1.1209 2.2088 2.0200 2.0128 2.1163 2.0771 3.3928 3.1014 2.8953 3.0592 3.0181 4.2101 4.0262 3.7519 3.7527 4.1708 4.0181 3.9008 4.0151 3.9390 4.2176 3.9483 4.1629 3.8077 3.9664 3.8578 1.0263 1.0062 1.0122 1.0024 0.9884 0.9977 0.9970 1.0054 1.0035 1.0037 0.9958 0.9944 0.9932
dispcorr: -0.023331913 hartree
energy: -2187.726387115277
dipole: -0.51051 -0.83459 -1.34510 -4.19162 5.88814 1.69652 4.35235 -7.02373 -2.67138
magnitude: 3.43857 au
magnitude: 8.74015 debye
