program: Orca
programVersion: 5.0.2
elementType: Cl S F O O O O O N N N N N C C C C C C C C C C C C C C C H H H H H H H H H H H H H
charge: 0
multiplicity: 1
keywords: wb97x-d3
keywords: def2-TZVPP
keywords: def2/J RIJCOSX
keywords: DEFGRID2
keywords: scfconv7
keywords: smallprint printgap noloewdin
keywords: NOSOSCF
formula: C15H13ClFN5O5S
InChI: InChI=1/C15H13ClFN5O5S/c1-3-27-15-18-10(17)7-11-19-14(20-22(11)15)28(24,25)21-12-8(13(23)26-2)5-4-6-9(12)16/h4-7,21H,3H2,1-2H3
41 atoms
Cl 0.597034 1.667975 1.869156
S  1.480876 0.646559 -1.801095
F  -5.028649 3.163897 0.402454
O  -2.885476 -0.794792 0.844737
O  2.013224 1.75893 -2.548522
O  1.46625 -0.702555 -2.319929
O  2.88309 -3.241424 -1.115873
O  4.246786 -1.486203 -0.885965
N  -1.967209 0.827614 -0.387069
N  2.278541 0.618064 -0.353947
N  -0.87163 0.128771 -0.696363
N  -0.732385 2.242106 -1.504955
N  -3.999615 1.20307 0.61648
C  -0.189933 1.033194 -1.347695
C  -1.890035 2.105395 -0.885107
C  1.918846 -0.332818 0.621897
C  2.306626 -1.668146 0.492455
C  -3.007991 0.408194 0.38318
C  1.116068 0.027864 1.704327
C  -2.967559 2.972088 -0.644683
C  1.86824 -2.609278 1.417253
C  0.707976 -0.901294 2.644051
C  -3.965515 2.433787 0.106025
C  1.081896 -2.225224 2.490352
C  3.251124 -2.090543 -0.584253
C  -3.885707 -1.299468 1.761089
C  -3.377405 -2.610819 2.294854
C  3.72425 -3.797312 -2.127969
H  2.560143 1.538548 -0.028421
H  -2.978981 3.983949 -1.019943
H  2.161728 -3.645215 1.317797
H  0.090446 -0.5963 3.47785
H  0.756988 -2.960143 3.214151
H  -4.032529 -0.574148 2.562253
H  -4.826848 -1.417818 1.222695
H  -4.113604 -3.013299 2.990446
H  -3.231619 -3.344043 1.501732
H  -2.439332 -2.486774 2.836744
H  3.795074 -3.135606 -2.991108
H  3.251641 -4.728507 -2.427966
H  4.723663 -4.006893 -1.746516
elementType: Cl S F O N C H
totalener: -2187.70135465 hartree
nucrepener: 3241.12355294 hartree
electener: -5428.82490760 hartree
oneelecener: -9452.11082742 hartree
twoeener: 4023.28591982 hartree
cpcmener: -0.04730037 hartree
kineticenergy: 2181.04996057 hartree
xcener: -161.665941704142 hartree
chargesum: 0.0000000
charge: -0.069631 0.872506 -0.176718 -0.257938 -0.488917 -0.483205 -0.273133 -0.423172 0.163314 -0.199731 -0.319637 -0.312225 -0.366340 0.085356 0.199299 0.125074 -0.000437 0.453476 0.015038 -0.270514 -0.147518 -0.102807 0.368204 -0.154666 0.434917 0.034054 -0.244798 -0.122582 0.185550 0.158047 0.147842 0.145197 0.161591 0.106817 0.116592 0.096336 0.094929 0.084080 0.118403 0.128023 0.119326
qa: -0.0696 0.8725 -0.1767 -0.2579 -0.4889 -0.4832 -0.2731 -0.4232 0.1633 -0.1997 -0.3196 -0.3122 -0.3663 0.0854 0.1993 0.1251 -0.0004 0.4535 0.0150 -0.2705 -0.1475 -0.1028 0.3682 -0.1547 0.4349 0.0341 -0.2448 -0.1226 0.1856 0.1580 0.1478 0.1452 0.1616 0.1068 0.1166 0.0963 0.0949 0.0841 0.1184 0.1280 0.1193
va: 1.2651 5.8213 1.1203 2.1992 2.0273 2.0065 2.1181 2.0773 3.4013 3.1014 2.8359 3.1145 3.0220 4.1797 4.0266 3.7326 3.7531 4.1678 4.0141 3.9072 4.0109 3.9237 4.2163 3.9270 4.1664 3.8074 3.9666 3.8578 1.0274 1.0065 1.0123 1.0030 0.9879 0.9985 0.9968 1.0071 1.0027 1.0032 0.9951 0.9944 0.9936
dispcorr: -0.025098941 hartree
energy: -2187.726453595646
dipole: 0.38210 -3.00601 -2.62391 -28.37354 26.45040 -1.92314 7.34596 -3.99449 3.35147
magnitude: 4.67073 au
magnitude: 11.87205 debye
