program: Orca
programVersion: 5.0.2
elementType: Cl S F O O O O O N N N N N C C C C C C C C C C C C C C C H H H H H H H H H H H H H
charge: 0
multiplicity: 1
keywords: wb97x-d3
keywords: def2-TZVPP
keywords: def2/J RIJCOSX
keywords: DEFGRID2
keywords: scfconv7
keywords: smallprint printgap noloewdin
keywords: NOSOSCF
formula: C15H13ClFN5O5S
InChI: InChI=1/C15H13ClFN5O5S/c1-3-27-15-18-10(17)7-11-19-14(20-22(11)15)28(24,25)21-12-8(13(23)26-2)5-4-6-9(12)16/h4-7,21H,3H2,1-2H3
41 atoms
Cl 4.576195 0.027102 1.657907
S  1.459808 1.808298 1.224271
F  -5.200068 0.966181 -1.699051
O  -2.381747 -1.80797 0.492296
O  1.692899 1.042678 2.425732
O  1.64055 3.238961 1.16199
O  -0.289943 -1.190451 -2.143605
O  0.831963 0.729892 -2.251192
N  -1.845397 0.349587 0.250096
N  2.391136 1.15222 0.023336
N  -0.656518 0.241181 0.85402
N  -0.979567 2.350987 0.090633
N  -3.833972 -0.407926 -0.61171
C  -0.20697 1.461636 0.716701
C  -2.043509 1.629131 -0.211599
C  2.499757 -0.253962 -0.057137
C  1.668034 -1.034191 -0.877434
C  -2.740481 -0.652797 0.032487
C  3.456797 -0.894142 0.728634
C  -3.236879 1.905085 -0.895721
C  1.783569 -2.419899 -0.859706
C  3.559006 -2.27673 0.748446
C  -4.056279 0.829861 -1.048982
C  2.713718 -3.035509 -0.040071
C  0.706038 -0.390377 -1.814277
C  -3.24648 -2.951873 0.284161
C  -4.369044 -2.99899 1.289351
C  -1.198087 -0.731822 -3.150941
H  2.299173 1.643217 -0.862769
H  -3.460983 2.889075 -1.27868
H  1.152635 -3.028202 -1.491805
H  4.301588 -2.755718 1.371954
H  2.792738 -4.1140 -0.026426
H  -3.615408 -2.943768 -0.741876
H  -2.577963 -3.802097 0.401886
H  -4.925905 -3.925606 1.13903
H  -3.990287 -3.001278 2.311459
H  -5.068023 -2.170991 1.173459
H  -0.68484 -0.587681 -4.102594
H  -1.688017 0.198795 -2.863055
H  -1.941904 -1.516219 -3.258436
elementType: Cl S F O N C H
totalener: -2187.70142015 hartree
nucrepener: 3279.47595892 hartree
electener: -5467.17737907 hartree
oneelecener: -9528.28921557 hartree
twoeener: 4061.11183650 hartree
cpcmener: -0.04601907 hartree
kineticenergy: 2181.02441101 hartree
xcener: -161.663679273425 hartree
chargesum: 0.0000000
charge: -0.056343 0.860274 -0.176352 -0.262191 -0.476819 -0.490407 -0.275596 -0.434661 0.164749 -0.214955 -0.307541 -0.313638 -0.368416 0.090066 0.197879 0.115873 -0.008658 0.443031 0.013257 -0.266602 -0.165272 -0.090049 0.361872 -0.147801 0.459656 0.051433 -0.258687 -0.147697 0.194735 0.156457 0.146576 0.142361 0.160813 0.100152 0.119439 0.098929 0.093800 0.093267 0.145052 0.119532 0.132485
qa: -0.0563 0.8603 -0.1764 -0.2622 -0.4768 -0.4904 -0.2756 -0.4347 0.1647 -0.2150 -0.3075 -0.3136 -0.3684 0.0901 0.1979 0.1159 -0.0087 0.4430 0.0133 -0.2666 -0.1653 -0.0900 0.3619 -0.1478 0.4597 0.0514 -0.2587 -0.1477 0.1947 0.1565 0.1466 0.1424 0.1608 0.1002 0.1194 0.0989 0.0938 0.0933 0.1451 0.1195 0.1325
va: 1.2623 5.8500 1.1212 2.2000 2.0138 2.0233 2.1156 2.0552 3.3958 3.0412 2.8356 3.1199 2.9727 4.1733 4.0194 3.8197 3.6550 4.1427 4.0420 3.8841 3.9936 3.9733 4.2037 3.9470 4.0583 3.8149 3.9352 3.8472 1.0357 1.0079 1.0199 1.0070 0.9897 1.0081 0.9921 1.0060 1.0040 1.0102 0.9967 0.9897 0.9913
dispcorr: -0.027133062 hartree
energy: -2187.728553209764
dipole: -17.49413 14.90535 -2.58878 -22.52448 18.29620 -4.22828 -8.38331 6.04051 -2.34280
magnitude: 5.48351 au
magnitude: 13.93798 debye
