program: Gaussian 09
title: 000068875
version: EM64L-G09RevD.01
frameworkgroup: C1[X(C12H13N5O4)]
method: RPBEPBE
basis: SDD
operation: Freq
keyword: #p
keyword: freq=noraman
keyword: PBEPBE/SDD
title: #p freq=noraman PBEPBE/SDD
converged: YES YES NO NO
title: Mulliken charges:
elementType: O O O O N N N N N C C C C C C C C C C C C H H H H H H H H H H H H H
charge: -0.318009 -0.286101 -0.121772 -0.264510 -0.160047 -0.202347 -0.035915 -0.438479 -0.039190 -0.415262 -0.405247 -0.432932 0.289874 -0.215819 -0.181849 -0.418585 0.456217 0.011206 0.060889 0.288991 -0.490247 0.225180 0.297119 0.242256 0.237884 0.215974 0.235463 0.217243 0.225829 0.302378 0.384065 0.246428 0.243326 0.245989
chargesum: 0.00000
title: Mulliken charges with hydrogens summed into heavy atoms:
elementType: O O O O N N N N N C C C C C C C C C C C C
charge: -0.318009 -0.286101 -0.121772 -0.264510 -0.160047 -0.202347 -0.035915 -0.054414 -0.039190 0.107037 0.074893 0.018505 0.289874 0.001424 0.043980 -0.116207 0.456217 0.011206 0.060889 0.288991 0.245495
polarizability: 2.71887155e+02 -1.86801793e+01 2.41018654e+02 2.27596239e+00 -5.29643399e+00 8.97425480e+01
1716.lowfreq: -5.6280 -1.5509 -0.0008 -0.0006 -0.0004 6.1424 37.3781 41.4153 62.2494
frequency: 37.3598 41.3835 62.2477 68.1349 71.2122 82.0109 97.5923 110.0250 127.3869 158.2490 166.5885 180.8431 224.1027 237.1447 258.1552 267.6703 277.8585 302.3206 330.7401 337.2789 383.2217 396.3425 455.0485 506.8645 517.8817 544.8395 580.6400 610.1699 614.4908 620.4546 654.3194 669.1468 674.4061 693.0691 714.3033 715.1005 757.3640 764.1400 767.0777 826.7915 827.5061 892.7466 912.3789 944.2214 966.1576 970.6306 981.2527 992.0880 1005.6914 1053.9731 1067.1836 1069.4727 1120.5893 1127.8487 1142.2673 1152.3815 1166.5228 1182.3672 1197.2203 1223.7241 1245.1521 1252.0939 1276.8365 1316.4039 1333.9205 1335.0012 1350.9719 1372.0400 1382.0438 1423.3235 1450.0250 1454.3741 1454.8005 1466.3816 1470.2064 1477.2049 1495.3415 1548.3477 1567.3400 1624.3204 1660.7047 1685.4033 1945.4371 2921.3587 2968.8014 2982.8603 2994.5826 3008.5961 3037.6882 3106.7006 3112.1370 3116.6770 3146.6798 3156.5218 3225.9505 3466.5462
redmass: 4.6120 3.5555 2.2899 4.6758 4.2366 1.8308 6.4448 6.8655 5.3728 4.4987 2.9427 3.7023 5.6301 5.6154 6.1884 7.1147 4.1674 5.5956 7.7108 5.3879 4.3565 2.4540 8.2742 3.4985 8.9779 7.6139 8.9475 7.5790 7.0146 7.4815 6.7280 1.3112 5.2447 4.8689 6.2323 6.0854 1.3499 4.2903 2.4023 5.5398 1.5269 4.2281 4.5790 2.5316 1.9011 1.5328 7.9953 1.7532 3.0680 2.0891 5.0072 1.9651 1.2546 2.2669 3.4730 1.4861 2.7135 1.4681 2.3326 1.2736 1.2767 2.0768 2.5891 2.8197 1.6681 1.5205 2.2442 1.7775 1.5449 1.2927 2.5771 1.1123 1.0489 1.1004 1.1046 1.1930 4.0876 5.5780 4.5843 6.8088 9.6687 6.4827 12.7946 1.0673 1.0705 1.0614 1.0910 1.0298 1.0986 1.0936 1.1052 1.0850 1.1001 1.1047 1.0923 1.0765
irintensity: 0.0131 0.2951 1.6124 1.6280 0.3382 3.1379 1.4918 12.7294 3.9559 25.8128 5.7762 13.1750 17.5886 60.2330 6.4600 0.3204 17.2197 9.4853 4.1692 4.5307 19.4961 10.0133 43.8387 1.2965 10.1574 6.7619 0.9819 5.6379 22.3003 7.3462 3.3352 51.1294 6.9530 0.2368 5.9683 1.4535 113.2095 6.9030 13.5707 19.5837 44.3242 13.6900 2.9050 19.0994 33.7370 12.8340 103.0174 7.5997 17.2582 11.4180 11.6330 3.5957 0.3827 94.0162 252.8882 38.5773 24.4275 73.5236 240.1915 14.2078 97.2415 125.9594 54.4146 17.8572 45.3160 23.2097 80.9567 18.8536 13.8286 26.4477 179.8699 36.6714 16.0834 5.7375 30.0625 111.2095 490.4441 80.7879 969.0135 684.0453 425.3482 0.5432 971.4607 40.4633 45.1026 31.1800 13.3268 37.8305 40.0002 4.5593 24.0118 6.6032 51.4327 12.5746 9.5591 93.6282
temp: 298.150 k
press: 1.00000 atm
elementType: 8 8 8 8 7 7 7 7 7 6 6 6 6 6 6 6 6 6 6 6 6 1 1 1 1 1 1 1 1 1 1 1 1 1
symmnumber: 1
zpe: 662330.3 jmol-1
zpe.correction: 0.252268 hartree
zpe.thermalcorrener: 0.271568 hartree
zpe.thermalcorrenthalpy: 0.272512 hartree
zpe.thermalcorrgfe: 0.203275 hartree
zpe.sumelectzpe: -1038.156596 hartree
zpe.sumelectthermal: -1038.137296 hartree
zpe.sumelectthermalent: -1038.136352 hartree
zpe.sumelectthermalfe: -1038.205589 hartree
dipole: 2.3273 -8.3449 0.2584
dipole: 8.6672
quadrupole: -98.6768 -141.0196 -120.6775
quadrupole: 18.4254 -0.3945 0.4455
quadrupole: 21.4478 -20.8950 -0.5528 18.4254 -0.3945 0.4455
hfenergy: -1038.4088641 hartree
pointgroup: C01 [X(C12H13N5O4)]
dipole: 1.2270342 -3.1766199 -0.1765076 debye
polarizability: 275.1950554|-15.5148048|237.4994924|0.5568275|7.702294|89.9538096 unknown
InChI: InChI=1S/C12H13N5O4/c1-21-12(19)15-10-7-9(16-5-3-2-4-6-16)14-11(13-8-18)17(10)20/h2-3,7,15H,4-6H2,1H3
charge 0 multiplicity 1
34 atoms
O  -2.637642 1.670465 0.142302
O  -3.841845 -2.714672 -0.221022
O  -2.921233 4.258983 0.331782
O  -1.547609 -3.224446 -0.107037
N  2.506985 -0.253446 0.308649
N  -1.380857 1.070516 0.177959
N  0.965734 1.517394 0.377868
N  -2.383909 -1.010476 -0.010201
N  -0.708447 3.261076 0.403737
C  3.599605 0.699568 0.626912
C  2.857202 -1.685585 0.203066
C  4.77192 0.548786 -0.362313
C  1.191219 0.157102 0.281292
C  4.302717 -1.908508 -0.19224
C  5.168526 -0.908266 -0.491569
C  0.112871 -0.788716 0.159452
C  -1.196083 -0.292525 0.104571
C  -0.295558 1.958275 0.326764
C  -2.010689 3.451471 0.329811
C  -2.489928 -2.396244 -0.111863
C  -4.142029 -4.160591 -0.333074
H  3.963361 0.492241 1.654554
H  3.167581 1.710284 0.606855
H  2.217224 -2.153182 -0.571754
H  2.633659 -2.215827 1.156577
H  5.627118 1.150221 0.000943
H  4.491846 0.964479 -1.350851
H  4.609075 -2.959557 -0.262724
H  6.18755 -1.147888 -0.819973
H  0.252868 -1.86677 0.129399
H  -3.245073 -0.448079 -0.024993
H  -3.657189 -4.582247 -1.229102
H  -5.236206 -4.209665 -0.414527
H  -3.785862 -4.694171 0.563747
