program: Orca
programVersion: 5.0.2
elementType: Cl S F O O O O O N N N N N C C C C C C C C C C C C C C C H H H H H H H H H H H H H
charge: 0
multiplicity: 1
keywords: wb97x-d3
keywords: def2-TZVPP
keywords: def2/J RIJCOSX
keywords: DEFGRID2
keywords: scfconv7
keywords: smallprint printgap noloewdin
keywords: NOSOSCF
formula: C15H13ClFN5O5S
InChI: InChI=1/C15H13ClFN5O5S/c1-3-27-15-18-10(17)7-11-19-14(20-22(11)15)28(24,25)21-12-8(13(23)26-2)5-4-6-9(12)16/h4-7,21H,3H2,1-2H3
41 atoms
Cl -0.014569 -1.132718 -2.208463
S  0.769026 -0.836378 1.62275
F  -4.043143 3.633778 -1.621568
O  -4.448521 -0.373051 0.4324
O  0.195513 -1.882938 2.436039
O  1.715949 0.129262 2.135243
O  4.764051 0.325947 1.419602
O  4.200796 -1.834515 1.335789
N  -2.435791 0.599455 0.29957
N  1.466335 -1.582078 0.334249
N  -1.785476 -0.373361 0.950251
N  -0.362649 1.285252 0.347981
N  -4.25515 1.661494 -0.618103
C  -0.571608 0.105607 0.939206
C  -1.573533 1.606036 -0.065921
C  2.164263 -0.83959 -0.637607
C  3.445209 -0.351223 -0.372112
C  -3.7669 0.646093 0.015246
C  1.580334 -0.55928 -1.872101
C  -2.097371 2.710817 -0.755358
C  4.103175 0.419574 -1.323117
C  2.2528 0.170706 -2.836811
C  -3.436915 2.647541 -0.980718
C  3.514248 0.664957 -2.55273
C  4.153787 -0.717502 0.890408
C  -5.867493 -0.433679 0.146169
C  -6.132861 -0.927004 -1.253719
C  5.538822 0.103947 2.599674
H  0.999074 -2.435804 0.04148
H  -1.473129 3.532992 -1.070545
H  5.092034 0.807104 -1.11911
H  1.788909 0.364864 -3.794216
H  4.039386 1.246372 -3.298052
H  -6.250136 -1.131065 0.887842
H  -6.316824 0.542612 0.328268
H  -7.210561 -1.031728 -1.384114
H  -5.773645 -0.234251 -2.013997
H  -5.681004 -1.903989 -1.424991
H  4.919879 -0.267855 3.416463
H  5.948675 1.07241 2.872465
H  6.355725 -0.593949 2.414752
elementType: Cl S F O N C H
totalener: -2187.70261785 hartree
nucrepener: 3157.55592012 hartree
electener: -5345.25853798 hartree
oneelecener: -9285.60231773 hartree
twoeener: 3940.34377975 hartree
cpcmener: -0.04637636 hartree
kineticenergy: 2181.01790117 hartree
xcener: -161.661009246440 hartree
chargesum: -0.0000000
charge: -0.067389 0.868067 -0.177404 -0.264828 -0.491785 -0.485422 -0.272341 -0.423527 0.169913 -0.206610 -0.289680 -0.335709 -0.374050 0.077074 0.205551 0.134904 0.011661 0.460323 -0.015191 -0.277637 -0.152901 -0.086456 0.366112 -0.152159 0.430563 0.054783 -0.259261 -0.123024 0.190446 0.158596 0.148792 0.146458 0.161626 0.119777 0.100073 0.098800 0.092640 0.093130 0.118216 0.128408 0.119459
qa: -0.0674 0.8681 -0.1774 -0.2648 -0.4918 -0.4854 -0.2723 -0.4235 0.1699 -0.2066 -0.2897 -0.3357 -0.3740 0.0771 0.2056 0.1349 0.0117 0.4603 -0.0152 -0.2776 -0.1529 -0.0865 0.3661 -0.1522 0.4306 0.0548 -0.2593 -0.1230 0.1904 0.1586 0.1488 0.1465 0.1616 0.1198 0.1001 0.0988 0.0926 0.0931 0.1182 0.1284 0.1195
va: 1.2613 5.8332 1.1206 2.2094 2.0179 2.0122 2.1177 2.0763 3.3959 3.1000 2.8977 3.0689 3.0026 4.2041 4.0290 3.7517 3.7464 4.1633 4.0223 3.8996 4.0159 3.9392 4.2139 3.9492 4.1647 3.8113 3.9326 3.8577 1.0219 1.0063 1.0116 1.0020 0.9884 0.9923 1.0100 1.0062 1.0100 1.0043 0.9953 0.9942 0.9936
dispcorr: -0.023202304 hartree
energy: -2187.725820156701
dipole: 0.85167 -2.22442 -1.37276 -2.57628 3.84834 1.27206 1.01508 -3.78764 -2.77256
magnitude: 3.34510 au
magnitude: 8.50256 debye
