program: Orca
programVersion: 5.0.2
elementType: Cl S F O O O O O N N N N N C C C C C C C C C C C C C C C H H H H H H H H H H H H H
charge: 0
multiplicity: 1
keywords: wb97x-d3
keywords: def2-TZVPP
keywords: def2/J RIJCOSX
keywords: DEFGRID2
keywords: scfconv7
keywords: smallprint printgap noloewdin
keywords: NOSOSCF
formula: C15H13ClFN5O5S
InChI: InChI=1/C15H13ClFN5O5S/c1-3-27-15-18-10(17)7-11-19-14(20-22(11)15)28(24,25)21-12-8(13(23)26-2)5-4-6-9(12)16/h4-7,21H,3H2,1-2H3
41 atoms
Cl 0.673091 1.773297 -1.576291
S  1.205014 0.314485 2.027332
F  -4.93702 3.147507 -0.739336
O  -2.983748 -0.924683 -1.019536
O  1.185514 -1.107939 2.286862
O  1.595428 1.285264 3.019941
O  3.041167 -3.262195 1.077768
O  4.27629 -1.407433 1.230801
N  -2.08142 0.649042 0.287054
N  2.171799 0.566188 0.712026
N  -1.045758 -0.102572 0.676453
N  -0.920196 1.972788 1.581791
N  -3.993105 1.138452 -0.887473
C  -0.407467 0.749794 1.433237
C  -2.00891 1.905501 0.838889
C  2.036398 -0.257453 -0.422919
C  2.556753 -1.552912 -0.418433
C  -3.071003 0.288299 -0.575823
C  1.346633 0.182253 -1.552732
C  -3.015954 2.827546 0.517317
C  2.365245 -2.382111 -1.516923
C  1.186911 -0.629653 -2.661847
C  -3.951105 2.356241 -0.349834
C  1.694263 -1.917099 -2.6356
C  3.381902 -2.036647 0.728675
C  -3.931523 -1.390351 -2.011452
C  -3.541275 -0.944801 -3.397659
C  3.766967 -3.863204 2.151565
H  2.414433 1.541252 0.56164
H  -3.0225 3.828599 0.920617
H  2.763618 -3.387437 -1.514187
H  0.65808 -0.264378 -3.531765
H  1.563793 -2.560432 -3.49496
H  -3.887998 -2.473077 -1.919456
H  -4.934716 -1.061543 -1.741186
H  -4.227199 -1.398634 -4.113795
H  -3.603845 0.136012 -3.519465
H  -2.532263 -1.270737 -3.651101
H  4.823685 -3.974085 1.907804
H  3.325818 -4.84558 2.294649
H  3.664105 -3.285769 3.070279
elementType: Cl S F O N C H
totalener: -2187.70113008 hartree
nucrepener: 3231.79753565 hartree
electener: -5419.49866573 hartree
oneelecener: -9433.57844842 hartree
twoeener: 4014.07978269 hartree
cpcmener: -0.04665255 hartree
kineticenergy: 2181.04793468 hartree
xcener: -161.666155519468 hartree
chargesum: -0.0000000
charge: -0.068262 0.871737 -0.177014 -0.264778 -0.484100 -0.488410 -0.271915 -0.422273 0.163729 -0.197053 -0.311381 -0.313991 -0.370741 0.083999 0.184002 0.124220 0.007319 0.460472 -0.000572 -0.265490 -0.149761 -0.090117 0.363242 -0.153143 0.430900 0.052566 -0.259163 -0.122701 0.185226 0.157980 0.148297 0.143854 0.161719 0.119852 0.101493 0.101520 0.092943 0.090317 0.119674 0.128294 0.117510
qa: -0.0683 0.8717 -0.1770 -0.2648 -0.4841 -0.4884 -0.2719 -0.4223 0.1637 -0.1971 -0.3114 -0.3140 -0.3707 0.0840 0.1840 0.1242 0.0073 0.4605 -0.0006 -0.2655 -0.1498 -0.0901 0.3632 -0.1531 0.4309 0.0526 -0.2592 -0.1227 0.1852 0.1580 0.1483 0.1439 0.1617 0.1199 0.1015 0.1015 0.0929 0.0903 0.1197 0.1283 0.1175
va: 1.2668 5.8212 1.1207 2.2031 2.0086 2.0281 2.1162 2.0774 3.3943 3.0995 2.8489 3.1097 3.0045 4.1949 4.0433 3.7562 3.7564 4.1576 4.0144 3.9044 4.0143 3.9270 4.2175 3.9472 4.1639 3.8133 3.9356 3.8576 1.0269 1.0067 1.0116 1.0032 0.9882 0.9922 1.0091 1.0070 1.0095 1.0036 0.9938 0.9943 0.9960
dispcorr: -0.024831567 hartree
energy: -2187.725961644518
dipole: 1.40664 -3.55475 -2.14811 -23.34281 21.90460 -1.43821 -10.97565 7.22143 -3.75422
magnitude: 4.55818 au
magnitude: 11.58597 debye
