program: Orca
programVersion: 5.0.2
elementType: Cl S F O O O O O N N N N N C C C C C C C C C C C C C C C H H H H H H H H H H H H H
charge: 0
multiplicity: 1
keywords: wb97x-d3
keywords: def2-TZVPP
keywords: def2/J RIJCOSX
keywords: DEFGRID2
keywords: scfconv7
keywords: smallprint printgap noloewdin
keywords: NOSOSCF
formula: C15H13ClFN5O5S
InChI: InChI=1/C15H13ClFN5O5S/c1-3-27-15-18-10(17)7-11-19-14(20-22(11)15)28(24,25)21-12-8(13(23)26-2)5-4-6-9(12)16/h4-7,21H,3H2,1-2H3
41 atoms
Cl 4.576053 1.45557 0.383259
S  1.337165 0.881438 1.976657
F  -5.463888 -1.398705 0.460561
O  -2.590711 1.390219 -1.633549
O  1.42378 0.594881 3.389308
O  1.635722 2.183461 1.42893
O  0.956154 -2.579431 0.286667
O  -0.535446 -1.774209 -1.167684
N  -1.992491 0.445032 0.305839
N  2.287959 -0.225188 1.212177
N  -0.785684 1.019056 0.357074
N  -1.094755 -0.36321 2.126809
N  -4.056736 -0.030401 -0.584347
C  -0.318226 0.495223 1.459568
C  -2.183817 -0.389459 1.379645
C  2.472821 -0.148361 -0.186869
C  1.644887 -0.825556 -1.09124
C  -2.92946 0.596102 -0.67027
C  3.496182 0.653811 -0.690691
C  -3.406539 -1.069807 1.483288
C  1.826621 -0.666168 -2.458762
C  3.68812 0.79518 -2.056466
C  -4.272703 -0.822527 0.464338
C  2.846777 0.138643 -2.936745
C  0.558833 -1.754629 -0.66209
C  -3.516074 1.580087 -2.731963
C  -2.848328 2.488145 -3.728141
C  0.018943 -3.548469 0.768632
H  2.289115 -1.145066 1.642851
H  -3.623442 -1.729884 2.309159
H  1.180108 -1.187077 -3.152189
H  4.492927 1.414412 -2.428438
H  2.995535 0.249426 -4.002196
H  -3.749059 0.608529 -3.169532
H  -4.437274 2.016795 -2.34418
H  -3.523619 2.634937 -4.57097
H  -2.629006 3.466836 -3.301794
H  -1.924807 2.055642 -4.112876
H  -0.865221 -3.074671 1.192962
H  0.539321 -4.100278 1.545815
H  -0.277854 -4.233219 -0.025251
elementType: Cl S F O N C H
totalener: -2187.70238891 hartree
nucrepener: 3247.66018772 hartree
electener: -5435.36257663 hartree
oneelecener: -9465.33602730 hartree
twoeener: 4029.97345067 hartree
cpcmener: -0.04357912 hartree
kineticenergy: 2181.01831788 hartree
xcener: -161.659649681396 hartree
chargesum: 0.0000000
charge: -0.054500 0.855670 -0.176574 -0.258015 -0.492873 -0.476604 -0.272170 -0.437827 0.174266 -0.226834 -0.303951 -0.330032 -0.367119 0.085908 0.188697 0.084483 0.034952 0.454363 0.043676 -0.279995 -0.162104 -0.105990 0.377661 -0.145160 0.445141 0.038042 -0.245300 -0.125784 0.197981 0.157817 0.147172 0.141823 0.161530 0.109111 0.110360 0.092124 0.092440 0.091068 0.116596 0.132531 0.127417
qa: -0.0545 0.8557 -0.1766 -0.2580 -0.4929 -0.4766 -0.2722 -0.4378 0.1743 -0.2268 -0.3040 -0.3300 -0.3671 0.0859 0.1887 0.0845 0.0350 0.4544 0.0437 -0.2800 -0.1621 -0.1060 0.3777 -0.1452 0.4451 0.0380 -0.2453 -0.1258 0.1980 0.1578 0.1472 0.1418 0.1615 0.1091 0.1104 0.0921 0.0924 0.0911 0.1166 0.1325 0.1274
va: 1.2653 5.8648 1.1218 2.2057 2.0195 2.0163 2.1366 2.0521 3.3995 3.0530 2.8716 3.0921 3.0172 4.1638 4.0163 3.8229 3.6440 4.1641 4.0225 3.8829 3.9720 3.9767 4.2144 3.9440 4.0876 3.8088 3.9675 3.8667 1.0235 1.0064 1.0127 1.0076 0.9889 0.9974 0.9969 1.0054 1.0032 1.0037 0.9853 0.9941 0.9929
dispcorr: -0.025645242 hartree
energy: -2187.728034151217
dipole: -9.88936 8.67909 -1.21027 -4.20114 2.19826 -2.00288 -20.32868 17.36012 -2.96855
magnitude: 3.78002 au
magnitude: 9.60806 debye
