program: Orca
programVersion: 5.0.2
elementType: Cl S F O O O O O N N N N N C C C C C C C C C C C C C C C H H H H H H H H H H H H H
charge: 0
multiplicity: 1
keywords: wb97x-d3
keywords: def2-TZVPP
keywords: def2/J RIJCOSX
keywords: DEFGRID2
keywords: scfconv7
keywords: smallprint printgap noloewdin
keywords: NOSOSCF
formula: C15H13ClFN5O5S
InChI: InChI=1/C15H13ClFN5O5S/c1-3-27-15-18-10(17)7-11-19-14(20-22(11)15)28(24,25)21-12-8(13(23)26-2)5-4-6-9(12)16/h4-7,21H,3H2,1-2H3
41 atoms
Cl 0.869489 2.231517 0.439865
S  0.574219 -1.631608 1.007733
F  -4.180757 2.279316 -2.941961
O  -3.914315 1.297763 1.462902
O  1.016308 -2.605671 0.035122
O  0.167472 -1.99865 2.34322
O  4.02159 -2.179533 0.947307
O  3.986162 -2.948291 -1.147482
N  -2.391822 0.455262 0.051813
N  1.773828 -0.509716 1.16183
N  -1.698433 -0.201764 0.990812
N  -0.763923 -0.492468 -1.055193
N  -4.063849 1.797605 -0.774109
C  -0.758529 -0.734427 0.258025
C  -1.825424 0.27946 -1.188259
C  2.377769 0.027516 0.007143
C  3.296792 -0.717625 -0.737054
C  -3.507216 1.215574 0.23697
C  2.030525 1.30246 -0.442695
C  -2.426872 0.906184 -2.289611
C  3.811603 -0.19565 -1.918429
C  2.586814 1.841815 -1.589304
C  -3.530227 1.639723 -1.983691
C  3.470589 1.079598 -2.333951
C  3.777982 -2.075908 -0.342098
C  -5.092602 2.08894 1.762796
C  -6.364731 1.333117 1.474199
C  4.488619 -3.44112 1.427614
H  1.65447 0.109834 1.958632
H  -2.029967 0.803395 -3.288025
H  4.505621 -0.782236 -2.505143
H  2.312562 2.837447 -1.910794
H  3.894205 1.485317 -3.242685
H  -4.993909 2.301323 2.825242
H  -5.042975 3.032002 1.217386
H  -7.208523 1.943169 1.799285
H  -6.496339 1.12733 0.412219
H  -6.403652 0.39224 2.02405
H  3.749382 -4.22555 1.262791
H  4.643966 -3.312578 2.495308
H  5.431038 -3.724474 0.958653
elementType: Cl S F O N C H
totalener: -2187.70198239 hartree
nucrepener: 3177.42458730 hartree
electener: -5365.12656969 hartree
oneelecener: -9324.91372256 hartree
twoeener: 3959.78715287 hartree
cpcmener: -0.04551202 hartree
kineticenergy: 2181.02267664 hartree
xcener: -161.661801017748 hartree
chargesum: -0.0000000
charge: -0.070403 0.867674 -0.176891 -0.264867 -0.484829 -0.493274 -0.258373 -0.444632 0.169269 -0.202027 -0.289166 -0.331142 -0.373079 0.077439 0.201375 0.127735 0.015524 0.460681 -0.010568 -0.275373 -0.138740 -0.081279 0.365722 -0.154697 0.431430 0.053613 -0.259970 -0.128642 0.184769 0.158104 0.144349 0.144222 0.161621 0.120238 0.100848 0.098984 0.093406 0.093894 0.120323 0.126822 0.119909
qa: -0.0704 0.8677 -0.1769 -0.2649 -0.4848 -0.4933 -0.2584 -0.4446 0.1693 -0.2020 -0.2892 -0.3311 -0.3731 0.0774 0.2014 0.1277 0.0155 0.4607 -0.0106 -0.2754 -0.1387 -0.0813 0.3657 -0.1547 0.4314 0.0536 -0.2600 -0.1286 0.1848 0.1581 0.1443 0.1442 0.1616 0.1202 0.1008 0.0990 0.0934 0.0939 0.1203 0.1268 0.1199
va: 1.2609 5.8172 1.1214 2.2098 2.0134 2.0167 2.1288 2.0578 3.3950 3.1044 2.8952 3.0623 3.0026 4.2238 4.0272 3.7619 3.7750 4.1622 4.0042 3.8980 3.9826 3.9407 4.2151 3.9512 4.1616 3.8103 3.9311 3.8631 1.0284 1.0066 1.0128 1.0025 0.9886 0.9921 1.0094 1.0061 1.0103 1.0040 0.9945 0.9956 0.9944
dispcorr: -0.023794654 hartree
energy: -2187.725777043449
dipole: -2.33143 1.23870 -1.09272 -3.46578 6.89110 3.42532 6.67581 -6.47095 0.20486
magnitude: 3.60123 au
magnitude: 9.15359 debye
