program: Orca
programVersion: 5.0.2
elementType: Cl S F O O O O O N N N N N C C C C C C C C C C C C C C C H H H H H H H H H H H H H
charge: 0
multiplicity: 1
keywords: wb97x-d3
keywords: def2-TZVPP
keywords: def2/J RIJCOSX
keywords: DEFGRID2
keywords: scfconv7
keywords: smallprint printgap noloewdin
keywords: NOSOSCF
formula: C15H13ClFN5O5S
InChI: InChI=1/C15H13ClFN5O5S/c1-3-27-15-18-10(17)7-11-19-14(20-22(11)15)28(24,25)21-12-8(13(23)26-2)5-4-6-9(12)16/h4-7,21H,3H2,1-2H3
41 atoms
Cl 0.884238 1.797515 1.655643
S  1.26682 0.203157 -1.907499
F  -4.88043 3.27382 0.608419
O  -2.930771 -0.763271 1.221202
O  1.702491 1.143816 -2.910846
O  1.173981 -1.218701 -2.153911
O  4.062141 -1.625638 -1.165297
O  2.978981 -3.545024 -0.81975
N  -2.009261 0.70984 -0.184519
N  2.248163 0.421032 -0.601403
N  -0.981361 -0.077316 -0.519692
N  -0.820019 1.937576 -1.547149
N  -3.943744 1.27972 0.914633
C  -0.325732 0.718966 -1.321446
C  -1.917141 1.928454 -0.81288
C  2.080439 -0.366868 0.553443
C  2.497187 -1.701258 0.585901
C  -3.016631 0.409909 0.681155
C  1.450496 0.164132 1.680933
C  -2.92497 2.873795 -0.570613
C  2.259257 -2.469456 1.720216
C  1.25507 -0.590364 2.823758
C  -3.883908 2.460122 0.300387
C  1.658064 -1.914344 2.835711
C  3.182766 -2.387566 -0.55087
C  -3.93888 -1.187968 2.170268
C  -5.160774 -1.735248 1.478046
C  4.729905 -2.182243 -2.29912
H  2.563456 1.379097 -0.478986
H  -2.919789 3.846181 -1.038852
H  2.567713 -3.505757 1.738591
H  0.775669 -0.153089 3.688997
H  1.497808 -2.514822 3.720594
H  -3.43689 -1.959651 2.749664
H  -4.181824 -0.360681 2.837195
H  -5.845557 -2.115149 2.237388
H  -5.690163 -0.97386 0.906268
H  -4.907135 -2.562766 0.815763
H  5.376162 -1.395145 -2.677662
H  4.020704 -2.469796 -3.075795
H  5.336587 -3.044816 -2.023336
elementType: Cl S F O N C H
totalener: -2187.70146660 hartree
nucrepener: 3221.29588857 hartree
electener: -5408.99735518 hartree
oneelecener: -9412.44091484 hartree
twoeener: 4003.44355967 hartree
cpcmener: -0.04515207 hartree
kineticenergy: 2181.04102919 hartree
xcener: -161.666140416942 hartree
chargesum: -0.0000000
charge: -0.069573 0.870282 -0.177107 -0.264641 -0.493076 -0.485688 -0.259202 -0.444241 0.166481 -0.202596 -0.315302 -0.314550 -0.371080 0.093288 0.194702 0.111034 0.022937 0.460927 -0.001995 -0.270810 -0.133600 -0.087489 0.363692 -0.154503 0.430273 0.052409 -0.258298 -0.129661 0.185640 0.158261 0.143686 0.144646 0.161817 0.119055 0.100345 0.098778 0.092629 0.093897 0.127472 0.119300 0.121863
qa: -0.0696 0.8703 -0.1771 -0.2646 -0.4931 -0.4857 -0.2592 -0.4442 0.1665 -0.2026 -0.3153 -0.3146 -0.3711 0.0933 0.1947 0.1110 0.0229 0.4609 -0.0020 -0.2708 -0.1336 -0.0875 0.3637 -0.1545 0.4303 0.0524 -0.2583 -0.1297 0.1856 0.1583 0.1437 0.1446 0.1618 0.1191 0.1003 0.0988 0.0926 0.0939 0.1275 0.1193 0.1219
va: 1.2634 5.8091 1.1206 2.2037 2.0231 2.0082 2.1301 2.0586 3.3975 3.1056 2.8425 3.1133 3.0062 4.2078 4.0342 3.7738 3.7658 4.1544 3.9989 3.9048 3.9828 3.9421 4.2175 3.9495 4.1741 3.8129 3.9362 3.8617 1.0271 1.0067 1.0140 1.0028 0.9885 0.9918 1.0091 1.0061 1.0098 1.0041 0.9955 0.9960 0.9942
dispcorr: -0.024462492 hartree
energy: -2187.725929093107
dipole: -0.80806 -0.45060 -1.25865 -20.56282 20.96767 0.40485 5.76825 -2.37577 3.39248
magnitude: 3.64102 au
magnitude: 9.25474 debye
