program: Orca
programVersion: 5.0.2
elementType: Cl S F O O O O O N N N N N C C C C C C C C C C C C C C C H H H H H H H H H H H H H
charge: 0
multiplicity: 1
keywords: wb97x-d3
keywords: def2-TZVPP
keywords: def2/J RIJCOSX
keywords: DEFGRID2
keywords: scfconv7
keywords: smallprint printgap noloewdin
keywords: NOSOSCF
formula: C15H13ClFN5O5S
InChI: InChI=1/C15H13ClFN5O5S/c1-3-27-15-18-10(17)7-11-19-14(20-22(11)15)28(24,25)21-12-8(13(23)26-2)5-4-6-9(12)16/h4-7,21H,3H2,1-2H3
41 atoms
Cl 4.712952 0.759316 1.071418
S  1.188101 0.59351 2.095177
F  -3.9939 1.986416 -2.877841
O  -3.687314 -1.029802 0.473452
O  0.782013 -0.011065 3.342849
O  1.900135 1.845958 2.039935
O  0.545459 -2.455419 -0.199415
O  -0.523918 -1.22752 -1.7282
N  -2.052974 0.476928 0.194471
N  2.065363 -0.55473 1.288944
N  -1.27925 0.013804 1.183672
N  -0.284966 1.758482 0.13285
N  -3.861936 0.507922 -1.221859
C  -0.256367 0.822357 1.083478
C  -1.447966 1.530034 -0.447022
C  2.482248 -0.296011 -0.037574
C  1.709998 -0.66202 -1.149399
C  -3.252102 -0.021786 -0.213314
C  3.680393 0.382939 -0.253144
C  -2.105938 2.116496 -1.537071
C  2.113583 -0.301725 -2.428452
C  4.085239 0.731144 -1.533184
C  -3.292953 1.534427 -1.851458
C  3.293869 0.396311 -2.616983
C  0.448626 -1.453906 -1.051853
C  -4.96011 -1.617747 0.108514
C  -5.173132 -2.813787 0.994763
C  -0.586595 -3.31873 -0.051324
H  1.767973 -1.502928 1.499629
H  -1.678967 2.946525 -2.078949
H  1.50822 -0.578101 -3.281154
H  5.017547 1.259059 -1.680094
H  3.607548 0.670719 -3.614865
H  -5.7421 -0.869705 0.246691
H  -4.932352 -1.900751 -0.944311
H  -6.132054 -3.266174 0.742524
H  -4.40016 -3.568156 0.848059
H  -5.202181 -2.538257 2.04889
H  -1.453815 -2.776116 0.322278
H  -0.290978 -4.070165 0.674766
H  -0.835073 -3.80461 -0.994571
elementType: Cl S F O N C H
totalener: -2187.70140718 hartree
nucrepener: 3257.79242635 hartree
electener: -5445.49383354 hartree
oneelecener: -9485.43204333 hartree
twoeener: 4039.93820980 hartree
cpcmener: -0.04207879 hartree
kineticenergy: 2181.03134794 hartree
xcener: -161.661422892739 hartree
chargesum: 0.0000000
charge: -0.053498 0.858616 -0.176473 -0.261692 -0.493798 -0.471724 -0.269717 -0.434498 0.165361 -0.228603 -0.303834 -0.317806 -0.363372 0.077563 0.198333 0.082347 0.012832 0.456626 0.033010 -0.268741 -0.133484 -0.098764 0.366205 -0.156557 0.438485 0.033999 -0.245689 -0.110542 0.195952 0.157333 0.147126 0.141990 0.161345 0.117146 0.107955 0.095313 0.090213 0.092756 0.101251 0.131586 0.125447
qa: -0.0535 0.8586 -0.1765 -0.2617 -0.4938 -0.4717 -0.2697 -0.4345 0.1654 -0.2286 -0.3038 -0.3178 -0.3634 0.0776 0.1983 0.0823 0.0128 0.4566 0.0330 -0.2687 -0.1335 -0.0988 0.3662 -0.1566 0.4385 0.0340 -0.2457 -0.1105 0.1960 0.1573 0.1471 0.1420 0.1613 0.1171 0.1080 0.0953 0.0902 0.0928 0.1013 0.1316 0.1254
va: 1.2652 5.8553 1.1211 2.2005 2.0107 2.0301 2.1308 2.0532 3.4123 3.0559 2.8849 3.0911 3.0186 4.1600 4.0122 3.8084 3.6290 4.1517 4.0261 3.9134 3.9525 3.9647 4.2205 3.9565 4.0898 3.8071 3.9658 3.8564 1.0295 1.0064 1.0137 1.0075 0.9891 0.9979 0.9982 1.0058 1.0027 1.0037 1.0003 0.9956 0.9938
dispcorr: -0.026443078 hartree
energy: -2187.727850261010
dipole: -19.83671 18.01403 -1.82267 -21.96354 19.40313 -2.56041 -4.52868 2.07983 -2.44885
magnitude: 3.98431 au
magnitude: 10.12730 debye
