program: Orca
programVersion: 5.0.2
elementType: Cl S F O O O O O N N N N N C C C C C C C C C C C C C C C H H H H H H H H H H H H H
charge: 0
multiplicity: 1
keywords: wb97x-d3
keywords: def2-TZVPP
keywords: def2/J RIJCOSX
keywords: DEFGRID2
keywords: scfconv7
keywords: smallprint printgap noloewdin
keywords: NOSOSCF
formula: C15H13ClFN5O5S
InChI: InChI=1/C15H13ClFN5O5S/c1-3-27-15-18-10(17)7-11-19-14(20-22(11)15)28(24,25)21-12-8(13(23)26-2)5-4-6-9(12)16/h4-7,21H,3H2,1-2H3
41 atoms
Cl 4.558737 1.288661 0.303465
S  1.408157 0.80803 2.06711
F  -5.16332 -1.543278 -0.091757
O  -2.21694 1.435027 -1.795789
O  1.461978 0.460841 3.467082
O  1.806162 2.103402 1.572985
O  0.847806 -2.644038 0.435773
O  -0.670023 -1.903485 -1.022816
N  -1.826008 0.513934 0.205543
N  2.284948 -0.346061 1.26296
N  -0.625587 1.081166 0.364733
N  -1.083306 -0.325192 2.082669
N  -3.737526 -0.057257 -0.931868
C  -0.250888 0.538367 1.493385
C  -2.103051 -0.342063 1.24388
C  2.383989 -0.259867 -0.144026
C  1.490423 -0.913726 -1.005062
C  -2.64354 0.628325 -0.877272
C  3.371951 0.551418 -0.701346
C  -3.29873 -1.072703 1.202204
C  1.56441 -0.706073 -2.376396
C  3.44552 0.75055 -2.071759
C  -4.034409 -0.875071 0.07622
C  2.533356 0.128833 -2.904967
C  0.430996 -1.850758 -0.532549
C  -2.973097 1.573143 -3.022599
C  -4.098515 2.565696 -2.880664
C  -0.076408 -3.604776 0.958569
H  2.185201 -1.274182 1.664557
H  -3.577144 -1.756959 1.988949
H  0.865327 -1.205642 -3.03342
H  4.214942 1.389098 -2.483745
H  2.587848 0.288227 -3.973145
H  -2.234541 1.918464 -3.742742
H  -3.330834 0.593725 -3.340107
H  -3.732114 3.542134 -2.563975
H  -4.573638 2.688861 -3.854681
H  -4.862313 2.230399 -2.179989
H  0.458174 -4.131962 1.743458
H  -0.381833 -4.313216 0.188681
H  -0.957306 -3.124315 1.383534
elementType: Cl S F O N C H
totalener: -2187.69939359 hartree
nucrepener: 3285.50933215 hartree
electener: -5473.20872574 hartree
oneelecener: -9540.92009521 hartree
twoeener: 4067.71136947 hartree
cpcmener: -0.04164699 hartree
kineticenergy: 2181.03750818 hartree
xcener: -161.664704920422 hartree
chargesum: -0.0000000
charge: -0.054972 0.859884 -0.176788 -0.265755 -0.491814 -0.473560 -0.274092 -0.434563 0.163621 -0.224759 -0.304881 -0.332420 -0.369834 0.093564 0.179954 0.089067 0.023564 0.465038 0.028385 -0.272134 -0.147548 -0.098206 0.372297 -0.153028 0.447381 0.053939 -0.258085 -0.123917 0.193358 0.158618 0.145588 0.142048 0.161375 0.118735 0.099813 0.092984 0.098737 0.091830 0.132729 0.127638 0.116210
qa: -0.0550 0.8599 -0.1768 -0.2658 -0.4918 -0.4736 -0.2741 -0.4346 0.1636 -0.2248 -0.3049 -0.3324 -0.3698 0.0936 0.1800 0.0891 0.0236 0.4650 0.0284 -0.2721 -0.1475 -0.0982 0.3723 -0.1530 0.4474 0.0539 -0.2581 -0.1239 0.1934 0.1586 0.1456 0.1420 0.1614 0.1187 0.0998 0.0930 0.0987 0.0918 0.1327 0.1276 0.1162
va: 1.2637 5.8476 1.1228 2.2037 2.0201 2.0207 2.1352 2.0499 3.4133 3.0520 2.8816 3.0885 2.9955 4.1571 4.0236 3.8037 3.6290 4.1423 4.0303 3.8671 3.9575 3.9702 4.2141 3.9511 4.0666 3.8103 3.9368 3.8633 1.0322 1.0060 1.0154 1.0071 0.9891 0.9921 1.0103 1.0041 1.0061 1.0103 0.9942 0.9926 0.9870
dispcorr: -0.026980426 hartree
energy: -2187.726374019143
dipole: -13.75626 12.32346 -1.43280 -3.46739 1.64931 -1.81808 -17.46449 14.37450 -3.08999
magnitude: 3.86088 au
magnitude: 9.81358 debye
