program: Orca
programVersion: 5.0.2
elementType: Cl S F O O O O O N N N N N C C C C C C C C C C C C C C C H H H H H H H H H H H H H
charge: 0
multiplicity: 1
keywords: wb97x-d3
keywords: def2-TZVPP
keywords: def2/J RIJCOSX
keywords: DEFGRID2
keywords: scfconv7
keywords: smallprint printgap noloewdin
keywords: NOSOSCF
formula: C15H13ClFN5O5S
InChI: InChI=1/C15H13ClFN5O5S/c1-3-27-15-18-10(17)7-11-19-14(20-22(11)15)28(24,25)21-12-8(13(23)26-2)5-4-6-9(12)16/h4-7,21H,3H2,1-2H3
41 atoms
Cl 4.689966 0.588811 1.778722
S  1.141904 0.527893 1.964098
F  -4.123705 1.003054 -3.136155
O  -4.088389 -0.555982 1.104083
O  0.701485 0.058494 3.248949
O  1.838366 1.766692 1.748027
O  0.631665 -1.554499 -2.541589
O  0.526407 -2.179432 -0.411522
N  -2.199867 0.286865 0.230442
N  2.066921 -0.688405 1.298875
N  -1.446262 0.102814 1.323817
N  -0.227476 1.027518 -0.349818
N  -4.113116 0.225491 -1.048548
C  -0.295779 0.563471 0.909812
C  -1.4536 0.849507 -0.784793
C  2.806822 -0.440278 0.128275
C  2.360365 -0.829017 -1.145091
C  -3.515548 -0.017501 0.071711
C  4.042273 0.199987 0.238846
C  -2.098586 1.114329 -2.007825
C  3.133505 -0.547066 -2.266806
C  4.795965 0.488988 -0.887681
C  -3.416559 0.780946 -2.042285
C  4.33804 0.118852 -2.13847
C  1.087269 -1.580547 -1.296909
C  -5.477155 -0.917524 0.998121
C  -5.8870 -1.512754 2.320924
C  -0.54015 -2.311736 -2.812422
H  1.586173 -1.581506 1.319942
H  -1.572785 1.561713 -2.83612
H  2.793065 -0.847382 -3.246455
H  5.745923 0.992525 -0.775389
H  4.931676 0.339887 -3.014637
H  -6.062634 -0.028872 0.755312
H  -5.600498 -1.628563 0.179071
H  -6.934844 -1.806707 2.270879
H  -5.300023 -2.397855 2.561443
H  -5.777305 -0.795637 3.133121
H  -1.395833 -1.940319 -2.24804
H  -0.399863 -3.367486 -2.580296
H  -0.731932 -2.193667 -3.874953
totalener: -2187.67264695 hartree
nucrepener: 3192.57252262 hartree
electener: -5380.24516957 hartree
oneelecener: -9354.37569249 hartree
twoeener: 3974.13052292 hartree
kineticenergy: 2181.08207749 hartree
xcener: -161.665920488197 hartree
chargesum: 0.0000000
charge: -0.031867 0.833805 -0.161235 -0.226226 -0.426949 -0.421524 -0.263363 -0.390500 0.169188 -0.207107 -0.252050 -0.293873 -0.345143 0.071790 0.161873 0.095265 -0.000516 0.408171 0.009421 -0.300787 -0.146445 -0.087268 0.357601 -0.126328 0.417659 0.021310 -0.222163 -0.122786 0.167849 0.137423 0.127714 0.119333 0.129012 0.099354 0.097067 0.081492 0.091515 0.092631 0.088539 0.125843 0.122276
qa: -0.0319 0.8338 -0.1612 -0.2262 -0.4269 -0.4215 -0.2634 -0.3905 0.1692 -0.2071 -0.2521 -0.2939 -0.3451 0.0718 0.1619 0.0953 -0.0005 0.4082 0.0094 -0.3008 -0.1464 -0.0873 0.3576 -0.1263 0.4177 0.0213 -0.2222 -0.1228 0.1678 0.1374 0.1277 0.1193 0.1290 0.0994 0.0971 0.0815 0.0915 0.0926 0.0885 0.1258 0.1223
va: 1.2873 5.8900 1.1417 2.2244 2.0940 2.0738 2.1110 2.0893 3.3513 3.0641 2.8410 3.0477 3.0077 4.1449 3.9718 3.9088 3.7003 4.1834 4.1092 3.8644 4.0212 4.0152 4.2125 3.9722 4.1154 3.8436 3.9564 3.8834 1.0621 1.0180 1.0269 1.0166 1.0013 1.0000 1.0002 1.0061 1.0061 1.0060 0.9967 0.9996 0.9936
dispcorr: -0.024211215 hartree
energy: -2187.696858169395
dipole: -20.45767 18.86502 -1.59264 -13.87952 12.73237 -1.14715 -7.32520 4.97865 -2.34655
magnitude: 3.05921 au
magnitude: 7.77589 debye
