program: Orca
programVersion: 5.0.2
elementType: Cl S F O O O O O N N N N N C C C C C C C C C C C C C C C H H H H H H H H H H H H H
charge: 0
multiplicity: 1
keywords: wb97x-d3
keywords: def2-TZVPP
keywords: def2/J RIJCOSX
keywords: DEFGRID2
keywords: scfconv7
keywords: smallprint printgap noloewdin
keywords: NOSOSCF
formula: C15H13ClFN5O5S
InChI: InChI=1/C15H13ClFN5O5S/c1-3-27-15-18-10(17)7-11-19-14(20-22(11)15)28(24,25)21-12-8(13(23)26-2)5-4-6-9(12)16/h4-7,21H,3H2,1-2H3
41 atoms
Cl 4.679903 0.592334 1.781046
S  1.13615 0.737784 1.930942
F  -4.101792 0.841114 -3.210505
O  -4.06572 -0.510105 1.098141
O  0.697806 0.361498 3.246508
O  1.874736 1.935178 1.634197
O  0.537288 -1.473294 -2.490831
O  0.403501 -2.056627 -0.349129
N  -2.202287 0.38531 0.215513
N  2.000602 -0.55423 1.326113
N  -1.447553 0.259871 1.316346
N  -0.254254 1.179026 -0.379043
N  -4.090674 0.179628 -1.084249
C  -0.311775 0.748113 0.892088
C  -1.471379 0.944857 -0.812633
C  2.761124 -0.40154 0.152976
C  2.304603 -0.818763 -1.107939
C  -3.500268 0.013285 0.053853
C  4.032268 0.16678 0.250995
C  -2.111942 1.135863 -2.051341
C  3.107256 -0.639147 -2.229997
C  4.817528 0.35153 -0.875675
C  -3.407433 0.725179 -2.092264
C  4.351927 -0.048479 -2.114369
C  0.992498 -1.503647 -1.245935
C  -5.437655 -0.931442 0.980547
C  -5.828259 -1.571451 2.287949
C  -0.658184 -2.193747 -2.758715
H  1.475508 -1.420381 1.386289
H  -1.594222 1.57237 -2.890449
H  2.759336 -0.962017 -3.199826
H  5.797344 0.796143 -0.772155
H  4.969769 0.09033 -2.990589
H  -6.058785 -0.06289 0.753574
H  -5.528979 -1.62958 0.14675
H  -5.211184 -2.441181 2.508236
H  -5.747267 -0.87152 3.11814
H  -6.864865 -1.901188 2.225951
H  -1.496978 -1.815616 -2.174491
H  -0.540071 -3.257521 -2.551223
H  -0.862913 -2.048112 -3.815443
totalener: -2187.67229471 hartree
nucrepener: 3200.35961383 hartree
electener: -5388.03190854 hartree
oneelecener: -9369.88320175 hartree
twoeener: 3981.85129321 hartree
kineticenergy: 2181.07844728 hartree
xcener: -161.665178914650 hartree
chargesum: 0.0000000
charge: -0.031604 0.831571 -0.161423 -0.226436 -0.426074 -0.420681 -0.263730 -0.387650 0.171446 -0.205863 -0.252921 -0.287483 -0.347111 0.068873 0.154912 0.086043 0.009694 0.410852 0.012898 -0.296631 -0.148209 -0.088752 0.355552 -0.124996 0.411874 0.021362 -0.221881 -0.123723 0.167584 0.137001 0.127360 0.119564 0.129125 0.100137 0.096358 0.090913 0.093122 0.081465 0.085110 0.128148 0.124206
qa: -0.0316 0.8316 -0.1614 -0.2264 -0.4261 -0.4207 -0.2637 -0.3876 0.1714 -0.2059 -0.2529 -0.2875 -0.3471 0.0689 0.1549 0.0860 0.0097 0.4109 0.0129 -0.2966 -0.1482 -0.0888 0.3556 -0.1250 0.4119 0.0214 -0.2219 -0.1237 0.1676 0.1370 0.1274 0.1196 0.1291 0.1001 0.0964 0.0909 0.0931 0.0815 0.0851 0.1281 0.1242
va: 1.2882 5.8905 1.1411 2.2258 2.0942 2.0760 2.1074 2.0932 3.3525 3.0605 2.8411 3.0516 3.0017 4.1532 3.9747 3.9211 3.6874 4.1781 4.1083 3.8586 4.0215 4.0166 4.2085 3.9715 4.1239 3.8431 3.9561 3.8786 1.0614 1.0185 1.0268 1.0166 1.0012 0.9996 1.0009 1.0063 1.0058 1.0060 1.0003 0.9995 0.9932
dispcorr: -0.024607611 hartree
energy: -2187.696902319878
dipole: -20.48144 18.88951 -1.59193 -14.48503 13.17535 -1.30968 -7.10035 4.80077 -2.29958
magnitude: 3.08830 au
magnitude: 7.84983 debye
