program: Orca
programVersion: 5.0.2
elementType: Cl S F O O O O O N N N N N C C C C C C C C C C C C C C C H H H H H H H H H H H H H
charge: 0
multiplicity: 1
keywords: wb97x-d3
keywords: def2-TZVPP
keywords: def2/J RIJCOSX
keywords: DEFGRID2
keywords: scfconv7
keywords: smallprint printgap noloewdin
keywords: NOSOSCF
formula: C15H13ClFN5O5S
InChI: InChI=1/C15H13ClFN5O5S/c1-3-27-15-18-10(17)7-11-19-14(20-22(11)15)28(24,25)21-12-8(13(23)26-2)5-4-6-9(12)16/h4-7,21H,3H2,1-2H3
41 atoms
Cl 4.616998 0.740613 1.700186
S  1.065912 0.75055 1.933343
F  -4.106058 0.689962 -3.270359
O  -4.128139 -0.497726 1.090065
O  0.631945 0.332736 3.237883
O  1.773283 1.972297 1.662963
O  0.457819 -1.495066 -2.476348
O  0.396026 -2.06465 -0.328573
N  -2.257792 0.364806 0.197527
N  1.968155 -0.503918 1.307629
N  -1.514512 0.265268 1.308989
N  -0.306273 1.150247 -0.393654
N  -4.127836 0.107438 -1.119714
C  -0.375367 0.745702 0.886013
C  -1.517192 0.900369 -0.835519
C  2.69287 -0.315884 0.11668
C  2.220487 -0.743966 -1.134954
C  -3.552795 -0.014928 0.031922
C  3.939462 0.308127 0.184968
C  -2.14153 1.048382 -2.088199
C  2.978499 -0.511235 -2.277724
C  4.679564 0.54569 -0.962494
C  -3.431657 0.6222 -2.135733
C  4.194879 0.14064 -2.191981
C  0.939798 -1.491314 -1.24072
C  -5.497308 -0.927774 0.981485
C  -5.915645 -1.440519 2.33561
C  -0.711569 -2.268885 -2.708858
H  1.480406 -1.390586 1.379474
H  -1.614713 1.460761 -2.933802
H  2.617525 -0.839726 -3.240808
H  5.639037 1.037202 -0.88248
H  4.776077 0.323369 -3.08512
H  -6.113071 -0.085749 0.659941
H  -5.570012 -1.702278 0.215695
H  -5.850897 -0.663035 3.095558
H  -6.951082 -1.776055 2.285372
H  -5.303338 -2.283572 2.652124
H  -0.533446 -3.327963 -2.521529
H  -0.963781 -2.120357 -3.754613
H  -1.544234 -1.940996 -2.086904
totalener: -2187.67217481 hartree
nucrepener: 3205.90802091 hartree
electener: -5393.58019572 hartree
oneelecener: -9380.97564911 hartree
twoeener: 3987.39545340 hartree
kineticenergy: 2181.08606101 hartree
xcener: -161.667054037175 hartree
chargesum: -0.0000000
charge: -0.031756 0.833339 -0.161605 -0.226174 -0.427160 -0.421075 -0.265151 -0.387178 0.170699 -0.205683 -0.251668 -0.291247 -0.345309 0.071469 0.152415 0.092082 -0.000696 0.409018 0.011232 -0.289730 -0.148185 -0.087509 0.351837 -0.125689 0.418432 0.020799 -0.222226 -0.131027 0.168006 0.136825 0.127042 0.119328 0.129008 0.099501 0.097264 0.092368 0.081403 0.092139 0.129745 0.124946 0.090167
qa: -0.0318 0.8333 -0.1616 -0.2262 -0.4272 -0.4211 -0.2652 -0.3872 0.1707 -0.2057 -0.2517 -0.2912 -0.3453 0.0715 0.1524 0.0921 -0.0007 0.4090 0.0112 -0.2897 -0.1482 -0.0875 0.3518 -0.1257 0.4184 0.0208 -0.2222 -0.1310 0.1680 0.1368 0.1270 0.1193 0.1290 0.0995 0.0973 0.0924 0.0814 0.0921 0.1297 0.1249 0.0902
va: 1.2877 5.8905 1.1405 2.2258 2.0935 2.0755 2.1055 2.0941 3.3534 3.0637 2.8400 3.0500 3.0022 4.1484 3.9800 3.9111 3.6963 4.1801 4.1093 3.8564 4.0227 4.0154 4.2117 3.9721 4.1113 3.8439 3.9565 3.8775 1.0615 1.0186 1.0273 1.0167 1.0013 0.9999 1.0002 1.0060 1.0061 1.0060 0.9994 0.9923 0.9989
dispcorr: -0.024771159 hartree
energy: -2187.696945965367
dipole: -20.71604 19.10145 -1.61459 -14.17071 12.90479 -1.26592 -6.69380 4.39587 -2.29793
magnitude: 3.08058 au
magnitude: 7.83020 debye
