program: Orca
programVersion: 5.0.2
elementType: Cl S F O O O O O N N N N N C C C C C C C C C C C C C C C H H H H H H H H H H H H H
charge: 0
multiplicity: 1
keywords: wb97x-d3
keywords: def2-TZVPP
keywords: def2/J RIJCOSX
keywords: DEFGRID2
keywords: scfconv7
keywords: smallprint printgap noloewdin
keywords: NOSOSCF
formula: C15H13ClFN5O5S
InChI: InChI=1/C15H13ClFN5O5S/c1-3-27-15-18-10(17)7-11-19-14(20-22(11)15)28(24,25)21-12-8(13(23)26-2)5-4-6-9(12)16/h4-7,21H,3H2,1-2H3
41 atoms
Cl 4.761858 1.093064 0.298792
S  1.507272 1.486062 1.709349
F  -5.492473 -0.600264 0.911403
O  -2.290164 0.668538 -2.017746
O  1.576356 1.679362 3.130476
O  1.98268 2.435256 0.739191
O  -0.447307 -2.255787 -0.901658
O  0.341226 -1.990926 1.160797
N  -1.83485 0.674005 0.178978
N  2.242905 0.018468 1.38547
N  -0.56956 1.098244 0.054669
N  -1.095599 0.769515 2.235808
N  -3.91692 0.011227 -0.539143
C  -0.196325 1.130728 1.310807
C  -2.149635 0.477119 1.508929
C  2.482471 -0.342824 0.047239
C  1.6282 -1.186556 -0.684379
C  -2.727323 0.434282 -0.81764
C  3.624602 0.158196 -0.580621
C  -3.44726 0.02586 1.816423
C  1.913245 -1.477849 -2.014555
C  3.891654 -0.131298 -1.909205
C  -4.252975 -0.174847 0.739335
C  3.031428 -0.9423 -2.625798
C  0.460885 -1.830515 -0.028096
C  -3.157582 0.396688 -3.131847
C  -3.192512 -1.075455 -3.474294
C  -1.535999 -3.00711 -0.375939
H  1.8739 -0.723301 1.9719
H  -3.757657 -0.142714 2.83522
H  1.259843 -2.12926 -2.575596
H  4.781351 0.272614 -2.371503
H  3.245295 -1.170031 -3.660835
H  -4.15689 0.780289 -2.922991
H  -2.724849 0.977693 -3.943322
H  -3.745899 -1.212325 -4.403368
H  -2.187062 -1.468734 -3.621572
H  -3.694701 -1.656958 -2.702964
H  -2.171741 -3.243515 -1.224388
H  -2.106207 -2.440235 0.360726
H  -1.193669 -3.93021 0.092268
totalener: -2187.66950947 hartree
nucrepener: 3277.75226846 hartree
electener: -5465.42177793 hartree
oneelecener: -9524.19678447 hartree
twoeener: 4058.77500655 hartree
kineticenergy: 2181.05935148 hartree
xcener: -161.661710618601 hartree
chargesum: 0.0000000
charge: -0.029160 0.834334 -0.161528 -0.226252 -0.420533 -0.420941 -0.269455 -0.372070 0.149724 -0.208947 -0.282124 -0.247039 -0.344158 0.066127 0.162214 0.076633 0.027901 0.387830 0.017652 -0.251454 -0.154891 -0.088856 0.324532 -0.124154 0.392189 0.042604 -0.280682 -0.140639 0.169779 0.140034 0.122812 0.119216 0.127917 0.098127 0.115185 0.100381 0.097110 0.092184 0.116807 0.102331 0.139260
qa: -0.0292 0.8343 -0.1615 -0.2263 -0.4205 -0.4209 -0.2695 -0.3721 0.1497 -0.2089 -0.2821 -0.2470 -0.3442 0.0661 0.1622 0.0766 0.0279 0.3878 0.0177 -0.2515 -0.1549 -0.0889 0.3245 -0.1242 0.3922 0.0426 -0.2807 -0.1406 0.1698 0.1400 0.1228 0.1192 0.1279 0.0981 0.1152 0.1004 0.0971 0.0922 0.1168 0.1023 0.1393
va: 1.2905 5.8805 1.1397 2.2178 2.1044 2.0730 2.0896 2.1077 3.3383 3.0513 2.7831 3.1180 2.9665 4.1665 4.0188 3.9243 3.6612 4.1690 4.1070 3.8842 4.0270 4.0171 4.2258 3.9718 4.1178 3.8189 3.9226 3.8739 1.0596 1.0160 1.0265 1.0171 1.0014 1.0105 0.9922 1.0130 1.0017 1.0090 0.9909 0.9986 1.0028
dispcorr: -0.027326649 hartree
energy: -2187.696836116395
dipole: -15.04996 13.30417 -1.74579 -16.32053 14.37134 -1.94919 -22.45650 19.65584 -2.80066
magnitude: 3.83287 au
magnitude: 9.74237 debye
