program: Orca
programVersion: 5.0.2
elementType: Cl S F O O O O O N N N N N C C C C C C C C C C C C C C C H H H H H H H H H H H H H
charge: 0
multiplicity: 1
keywords: wb97x-d3
keywords: def2-TZVPP
keywords: def2/J RIJCOSX
keywords: DEFGRID2
keywords: scfconv7
keywords: smallprint printgap noloewdin
keywords: NOSOSCF
formula: C15H13ClFN5O5S
InChI: InChI=1/C15H13ClFN5O5S/c1-3-27-15-18-10(17)7-11-19-14(20-22(11)15)28(24,25)21-12-8(13(23)26-2)5-4-6-9(12)16/h4-7,21H,3H2,1-2H3
41 atoms
Cl 4.687643 1.152794 1.41112
S  1.166026 1.201234 1.712611
F  -4.222874 -3.012601 -0.936385
O  -3.914403 1.415084 -0.063332
O  1.906583 0.288831 2.53992
O  0.769678 2.519066 2.124138
O  0.497621 -1.378033 -2.565719
O  0.323574 0.720972 -1.851605
N  -2.182503 0.075753 0.418147
N  1.990384 1.368277 0.268101
N  -1.391091 1.044952 0.896225
N  -0.322778 -0.955474 0.926589
N  -4.083758 -0.830273 -0.508114
C  -0.311374 0.364048 1.176956
C  -1.529368 -1.139485 0.442343
C  2.730705 0.287923 -0.2430
C  2.252008 -0.565039 -1.252174
C  -3.445125 0.205254 -0.068458
C  4.013415 0.070475 0.264042
C  -2.223127 -2.270492 -0.025871
C  3.04488 -1.618172 -1.69963
C  4.788051 -0.987184 -0.183136
C  -3.482409 -2.021027 -0.473228
C  4.298998 -1.833957 -1.160244
C  0.932698 -0.32015 -1.893321
C  -5.24661 1.644629 -0.556218
C  -6.295459 1.324201 0.483007
C  -0.701986 -1.223467 -3.311678
H  1.445497 1.880541 -0.417699
H  -1.773684 -3.250433 -0.017474
H  2.681143 -2.274733 -2.47565
H  5.776646 -1.132689 0.229069
H  4.906043 -2.656399 -1.512352
H  -5.250729 2.703711 -0.805301
H  -5.403591 1.071063 -1.470459
H  -7.274306 1.612194 0.099015
H  -6.329105 0.26023 0.710225
H  -6.122738 1.879341 1.404135
H  -0.872574 -2.178196 -3.801417
H  -0.610393 -0.4380 -4.062383
H  -1.550851 -0.994167 -2.667355
totalener: -2187.67088403 hartree
nucrepener: 3210.49564592 hartree
electener: -5398.16652996 hartree
oneelecener: -9390.15529420 hartree
twoeener: 3991.98876424 hartree
kineticenergy: 2181.08135606 hartree
xcener: -161.666461660403 hartree
chargesum: 0.0000000
charge: -0.031994 0.829907 -0.162389 -0.229658 -0.420395 -0.424091 -0.263851 -0.389536 0.174087 -0.204454 -0.254335 -0.282744 -0.360359 0.066969 0.152116 0.086591 0.006246 0.419821 0.011237 -0.292372 -0.146860 -0.087034 0.350998 -0.124859 0.414386 0.038229 -0.260651 -0.115678 0.166813 0.136658 0.129217 0.120088 0.129501 0.115090 0.093120 0.087753 0.098483 0.097001 0.123506 0.126038 0.077406
qa: -0.0320 0.8299 -0.1624 -0.2297 -0.4204 -0.4241 -0.2639 -0.3895 0.1741 -0.2045 -0.2543 -0.2827 -0.3604 0.0670 0.1521 0.0866 0.0062 0.4198 0.0112 -0.2924 -0.1469 -0.0870 0.3510 -0.1249 0.4144 0.0382 -0.2607 -0.1157 0.1668 0.1367 0.1292 0.1201 0.1295 0.1151 0.0931 0.0878 0.0985 0.0970 0.1235 0.1260 0.0774
va: 1.2877 5.8884 1.1404 2.2314 2.0788 2.0949 2.1109 2.0910 3.3577 3.0549 2.8450 3.0584 2.9757 4.1643 3.9854 3.9230 3.6997 4.1647 4.1083 3.8562 4.0164 4.0157 4.1990 3.9705 4.1203 3.8292 3.9294 3.8832 1.0605 1.0189 1.0264 1.0163 1.0012 0.9912 1.0119 1.0095 1.0098 1.0037 0.9940 0.9992 1.0016
dispcorr: -0.025076102 hartree
energy: -2187.695960136977
dipole: -21.52725 19.88597 -1.64128 -1.76496 0.51433 -1.25063 -14.96129 12.56954 -2.39175
magnitude: 3.15885 au
magnitude: 8.02916 debye
