program: Orca
programVersion: 5.0.2
elementType: Cl S F O O O O O N N N N N C C C C C C C C C C C C C C C H H H H H H H H H H H H H
charge: 0
multiplicity: 1
keywords: wb97x-d3
keywords: def2-TZVPP
keywords: def2/J RIJCOSX
keywords: DEFGRID2
keywords: scfconv7
keywords: smallprint printgap noloewdin
keywords: NOSOSCF
formula: C15H13ClFN5O5S
InChI: InChI=1/C15H13ClFN5O5S/c1-3-27-15-18-10(17)7-11-19-14(20-22(11)15)28(24,25)21-12-8(13(23)26-2)5-4-6-9(12)16/h4-7,21H,3H2,1-2H3
41 atoms
Cl 4.654603 0.786112 1.701362
S  1.117979 0.650651 1.937922
F  -4.221265 0.506823 -3.094727
O  -4.070874 -0.718595 1.254345
O  0.739401 0.203353 3.249615
O  1.759026 1.907985 1.663226
O  0.59839 -1.523384 -2.531872
O  0.543841 -2.13064 -0.394336
N  -2.248021 0.181082 0.303329
N  2.059443 -0.555133 1.273839
N  -1.466264 0.091149 1.388902
N  -0.330775 1.002777 -0.349077
N  -4.159296 -0.087381 -0.948942
C  -0.350876 0.593904 0.930826
C  -1.550339 0.733364 -0.752106
C  2.780462 -0.316129 0.090391
C  2.330797 -0.741905 -1.170033
C  -3.543599 -0.212984 0.181486
C  4.004881 0.34874 0.175329
C  -2.219189 0.879555 -1.9815
C  3.089318 -0.471135 -2.304482
C  4.745449 0.623344 -0.963227
C  -3.505575 0.439459 -1.985698
C  4.283871 0.216928 -2.201412
C  1.074227 -1.525757 -1.294305
C  -5.446687 -1.138589 1.216381
C  -6.397153 0.02418 1.381814
C  -0.553663 -2.318363 -2.779079
H  1.601841 -1.459538 1.320417
H  -1.72795 1.305141 -2.841811
H  2.745746 -0.799254 -3.274101
H  5.688216 1.143974 -0.870091
H  4.867072 0.427219 -3.087156
H  -5.63872 -1.680248 0.289635
H  -5.527384 -1.833744 2.049373
H  -6.350343 0.710595 0.538302
H  -7.416451 -0.357967 1.440232
H  -6.194756 0.574755 2.299703
H  -0.783696 -2.18981 -3.832904
H  -1.404347 -1.98925 -2.18242
H  -0.366835 -3.37181 -2.570081
totalener: -2187.67169820 hartree
nucrepener: 3201.24643401 hartree
electener: -5388.91813220 hartree
oneelecener: -9371.68392032 hartree
twoeener: 3982.76578812 hartree
kineticenergy: 2181.08628975 hartree
xcener: -161.668516682213 hartree
chargesum: -0.0000000
charge: -0.032234 0.832591 -0.162444 -0.230430 -0.426166 -0.421562 -0.264166 -0.391271 0.167669 -0.206631 -0.253126 -0.295389 -0.357886 0.078184 0.162456 0.089777 0.004145 0.418434 0.010065 -0.305139 -0.146643 -0.087495 0.358667 -0.126195 0.418746 0.038807 -0.261062 -0.124153 0.168049 0.137629 0.127213 0.119384 0.128998 0.094584 0.114962 0.098479 0.087596 0.097141 0.123135 0.087827 0.127453
qa: -0.0322 0.8326 -0.1624 -0.2304 -0.4262 -0.4216 -0.2642 -0.3913 0.1677 -0.2066 -0.2531 -0.2954 -0.3579 0.0782 0.1625 0.0898 0.0041 0.4184 0.0101 -0.3051 -0.1466 -0.0875 0.3587 -0.1262 0.4187 0.0388 -0.2611 -0.1242 0.1680 0.1376 0.1272 0.1194 0.1290 0.0946 0.1150 0.0985 0.0876 0.0971 0.1231 0.0878 0.1275
va: 1.2869 5.8900 1.1407 2.2300 2.0947 2.0739 2.1102 2.0895 3.3555 3.0641 2.8444 3.0488 2.9831 4.1455 3.9694 3.9183 3.6930 4.1703 4.1088 3.8530 4.0201 4.0152 4.1979 3.9718 4.1206 3.8263 3.9303 3.8786 1.0615 1.0186 1.0270 1.0166 1.0013 1.0115 0.9913 1.0099 1.0096 1.0037 0.9933 0.9995 0.9996
dispcorr: -0.024823897 hartree
energy: -2187.696522092195
dipole: -21.46084 19.79783 -1.66301 -10.20306 9.06244 -1.14063 -9.25160 6.91201 -2.33958
magnitude: 3.08873 au
magnitude: 7.85093 debye
