program: Orca
programVersion: 5.0.2
elementType: Cl S F O O O O O N N N N N C C C C C C C C C C C C C C C H H H H H H H H H H H H H
charge: 0
multiplicity: 1
keywords: wb97x-d3
keywords: def2-TZVPP
keywords: def2/J RIJCOSX
keywords: DEFGRID2
keywords: scfconv7
keywords: smallprint printgap noloewdin
keywords: NOSOSCF
formula: C15H13ClFN5O5S
InChI: InChI=1/C15H13ClFN5O5S/c1-3-27-15-18-10(17)7-11-19-14(20-22(11)15)28(24,25)21-12-8(13(23)26-2)5-4-6-9(12)16/h4-7,21H,3H2,1-2H3
41 atoms
Cl 4.612167 0.888595 1.666899
S  1.078917 0.705415 1.912564
F  -4.273168 0.464973 -3.102061
O  -4.103889 -0.6994 1.263862
O  0.708392 0.263192 3.228446
O  1.699243 1.97064 1.626473
O  0.598273 -1.550893 -2.535447
O  0.539583 -2.111379 -0.385605
N  -2.286556 0.187587 0.29202
N  2.03673 -0.493121 1.25949
N  -1.501685 0.117875 1.37734
N  -0.374317 1.006892 -0.3779
N  -4.202879 -0.099635 -0.948217
C  -0.389933 0.618485 0.908388
C  -1.59369 0.725834 -0.773291
C  2.753161 -0.261408 0.071926
C  2.310204 -0.713087 -1.182047
C  -3.58234 -0.209083 0.181351
C  3.968443 0.421238 0.147176
C  -2.266582 0.852135 -2.002555
C  3.065282 -0.44789 -2.320063
C  4.706182 0.688586 -0.995067
C  -3.552974 0.411766 -1.995092
C  4.250238 0.258176 -2.22725
C  1.066336 -1.519052 -1.295534
C  -5.480208 -1.119494 1.240027
C  -6.427117 0.045598 1.408009
C  -0.544026 -2.363094 -2.771782
H  1.593495 -1.403776 1.320933
H  -1.779554 1.267228 -2.870375
H  2.727058 -0.795013 -3.284974
H  5.641956 1.223022 -0.909208
H  4.83021 0.463501 -3.11633
H  -5.680647 -1.665489 0.317709
H  -5.554168 -1.810375 2.077194
H  -7.446827 -0.333875 1.476865
H  -6.21566 0.600197 2.321486
H  -6.385856 0.728068 0.56082
H  -1.401015 -2.030869 -2.185697
H  -0.346726 -3.410196 -2.541143
H  -0.769935 -2.258278 -3.82935
totalener: -2187.67179921 hartree
nucrepener: 3198.60217629 hartree
electener: -5386.27397550 hartree
oneelecener: -9366.41498197 hartree
twoeener: 3980.14100646 hartree
kineticenergy: 2181.08453347 hartree
xcener: -161.668017994449 hartree
chargesum: 0.0000000
charge: -0.032282 0.832854 -0.162504 -0.230373 -0.426616 -0.421448 -0.263929 -0.391814 0.167215 -0.206771 -0.253357 -0.296978 -0.357262 0.079310 0.164937 0.090982 0.001486 0.418121 0.009641 -0.307344 -0.145609 -0.087367 0.359254 -0.126259 0.419866 0.038396 -0.260520 -0.123873 0.168024 0.137704 0.127356 0.119470 0.128982 0.094803 0.114905 0.087611 0.097327 0.097920 0.088492 0.126893 0.122757
qa: -0.0323 0.8329 -0.1625 -0.2304 -0.4266 -0.4214 -0.2639 -0.3918 0.1672 -0.2068 -0.2534 -0.2970 -0.3573 0.0793 0.1649 0.0910 0.0015 0.4181 0.0096 -0.3073 -0.1456 -0.0874 0.3593 -0.1263 0.4199 0.0384 -0.2605 -0.1239 0.1680 0.1377 0.1274 0.1195 0.1290 0.0948 0.1149 0.0876 0.0973 0.0979 0.0885 0.1269 0.1228
va: 1.2869 5.8901 1.1406 2.2300 2.0942 2.0743 2.1111 2.0889 3.3552 3.0645 2.8446 3.0489 2.9846 4.1448 3.9686 3.9176 3.6977 4.1711 4.1092 3.8541 4.0188 4.0146 4.1985 3.9715 4.1204 3.8268 3.9311 3.8798 1.0612 1.0185 1.0270 1.0165 1.0013 1.0116 0.9912 1.0096 1.0037 1.0099 0.9987 0.9995 0.9933
dispcorr: -0.024718458 hartree
energy: -2187.696517669841
dipole: -21.29080 19.64168 -1.64912 -10.47087 9.28863 -1.18224 -9.01505 6.69666 -2.31840
magnitude: 3.08095 au
magnitude: 7.83116 debye
