program: Orca
programVersion: 5.0.2
elementType: Cl S F O O O O O N N N N N C C C C C C C C C C C C C C C H H H H H H H H H H H H H
charge: 0
multiplicity: 1
keywords: wb97x-d3
keywords: def2-TZVPP
keywords: def2/J RIJCOSX
keywords: DEFGRID2
keywords: scfconv7
keywords: smallprint printgap noloewdin
keywords: NOSOSCF
formula: C15H13ClFN5O5S
InChI: InChI=1/C15H13ClFN5O5S/c1-3-27-15-18-10(17)7-11-19-14(20-22(11)15)28(24,25)21-12-8(13(23)26-2)5-4-6-9(12)16/h4-7,21H,3H2,1-2H3
41 atoms
Cl 3.309326 -1.49087 2.487163
S  1.324848 1.435103 1.772578
F  -4.244257 0.707722 -2.9705
O  -3.479718 -0.981825 1.148394
O  1.200821 0.607309 2.938709
O  1.518852 2.860346 1.838388
O  1.107003 0.530111 -3.057737
O  2.585578 1.687887 -1.859008
N  -1.949057 0.373022 0.215915
N  2.55099 0.864656 0.785877
N  -1.083361 0.334879 1.239992
N  -0.301125 1.653976 -0.427433
N  -3.872499 -0.1336 -0.942327
C  -0.137021 1.117392 0.793504
C  -1.466031 1.173727 -0.797843
C  2.40398 -0.397275 0.178549
C  2.00748 -0.517277 -1.166407
C  -3.147215 -0.263847 0.119567
C  2.649777 -1.5620 0.907082
C  -2.251736 1.319933 -1.954756
C  1.800708 -1.773046 -1.724183
C  2.432827 -2.810138 0.339905
C  -3.427412 0.637401 -1.93552
C  1.994946 -2.914513 -0.966534
C  1.931902 0.691776 -2.033241
C  -4.746429 -1.665495 1.111784
C  -4.916954 -2.373492 2.431239
C  0.993376 1.628311 -3.954302
H  2.84649 1.588719 0.134528
H  -1.936732 1.939417 -2.778652
H  1.499953 -1.860066 -2.758154
H  2.626453 -3.696614 0.927516
H  1.832332 -3.890345 -1.402906
H  -5.541873 -0.938534 0.938562
H  -4.749789 -2.364932 0.273672
H  -4.925374 -1.672431 3.264414
H  -5.868503 -2.904186 2.428898
H  -4.126077 -3.102414 2.601826
H  0.648467 2.523766 -3.436823
H  0.265269 1.327281 -4.702705
H  1.943319 1.850741 -4.440662
totalener: -2187.67107718 hartree
nucrepener: 3218.03982079 hartree
electener: -5405.71089797 hartree
oneelecener: -9404.99667259 hartree
twoeener: 3999.28577462 hartree
kineticenergy: 2181.07493282 hartree
xcener: -161.662223027454 hartree
chargesum: 0.0000000
charge: -0.021117 0.844719 -0.161132 -0.227472 -0.414896 -0.437566 -0.268373 -0.375553 0.154633 -0.227800 -0.260248 -0.336217 -0.344348 0.070730 0.225013 0.061440 -0.036377 0.410354 0.020399 -0.268827 -0.139499 -0.095389 0.340217 -0.133711 0.446855 0.020162 -0.221718 -0.161911 0.193062 0.129132 0.128448 0.119515 0.130761 0.099164 0.098608 0.092712 0.081728 0.091154 0.119986 0.122803 0.130559
qa: -0.0211 0.8447 -0.1611 -0.2275 -0.4149 -0.4376 -0.2684 -0.3756 0.1546 -0.2278 -0.2602 -0.3362 -0.3443 0.0707 0.2250 0.0614 -0.0364 0.4104 0.0204 -0.2688 -0.1395 -0.0954 0.3402 -0.1337 0.4469 0.0202 -0.2217 -0.1619 0.1931 0.1291 0.1284 0.1195 0.1308 0.0992 0.0986 0.0927 0.0817 0.0912 0.1200 0.1228 0.1306
va: 1.2971 5.8658 1.1427 2.2225 2.0879 2.0682 2.0909 2.1065 3.3582 3.0350 2.8455 3.0560 3.0241 4.1499 3.9535 3.8362 3.6858 4.1860 4.1137 3.8942 4.0282 4.0073 4.2669 3.9682 4.1160 3.8433 3.9555 3.8732 1.0599 1.0170 1.0258 1.0182 1.0004 1.0002 0.9996 1.0060 1.0061 1.0059 0.9939 0.9875 1.0011
dispcorr: -0.024154059 hartree
energy: -2187.695231240801
dipole: -15.02829 13.01150 -2.01679 -9.61243 7.67168 -1.94074 -9.10770 7.02725 -2.08045
magnitude: 3.48743 au
magnitude: 8.86435 debye
