program: Orca
programVersion: 5.0.2
elementType: Cl S F O O O O O N N N N N C C C C C C C C C C C C C C C H H H H H H H H H H H H H
charge: 0
multiplicity: 1
keywords: wb97x-d3
keywords: def2-TZVPP
keywords: def2/J RIJCOSX
keywords: DEFGRID2
keywords: scfconv7
keywords: smallprint printgap noloewdin
keywords: NOSOSCF
formula: C15H13ClFN5O5S
InChI: InChI=1/C15H13ClFN5O5S/c1-3-27-15-18-10(17)7-11-19-14(20-22(11)15)28(24,25)21-12-8(13(23)26-2)5-4-6-9(12)16/h4-7,21H,3H2,1-2H3
41 atoms
Cl 0.700389 1.935221 1.538415
S  1.313223 0.279289 -2.019544
F  -4.76051 3.3965 0.630997
O  -2.995442 -0.753321 0.979483
O  1.770738 1.22416 -2.999341
O  1.265684 -1.14575 -2.225118
O  2.925811 -3.370369 -0.765074
O  4.181863 -1.540167 -1.045046
N  -2.009523 0.754582 -0.351989
N  2.208264 0.558521 -0.642565
N  -0.996303 -0.039697 -0.71756
N  -0.776411 2.020944 -1.640055
N  -3.912746 1.341979 0.800187
C  -0.306749 0.776534 -1.474647
C  -1.873359 2.00572 -0.916209
C  1.988779 -0.211983 0.509575
C  2.429074 -1.535995 0.573931
C  -3.022262 0.454758 0.503121
C  1.292741 0.310866 1.600569
C  -2.849296 2.971615 -0.610377
C  2.147989 -2.303975 1.696691
C  1.054537 -0.440274 2.737099
C  -3.813579 2.556754 0.253849
C  1.479184 -1.755991 2.777536
C  3.274736 -2.113996 -0.516805
C  -4.004942 -1.140911 1.925655
C  -3.646801 -2.520632 2.417446
C  3.632211 -4.027257 -1.809295
H  2.428088 1.537961 -0.51039
H  -2.806654 3.966929 -1.022498
H  2.475448 -3.333062 1.736012
H  0.527828 -0.000075 3.572265
H  1.287291 -2.35497 3.657176
H  -4.03384 -0.41722 2.742296
H  -4.98052 -1.12571 1.43563
H  -4.397797 -2.852496 3.133715
H  -3.616862 -3.242477 1.602595
H  -2.67851 -2.525729 2.916176
H  3.215268 -5.028871 -1.867454
H  4.700813 -4.086723 -1.601144
H  3.485464 -3.515795 -2.760362
totalener: -2187.66867934 hartree
nucrepener: 3231.61495380 hartree
electener: -5419.28363314 hartree
oneelecener: -9432.25987708 hartree
twoeener: 4012.97624394 hartree
kineticenergy: 2181.08045569 hartree
xcener: -161.661938290444 hartree
chargesum: -0.0000000
charge: -0.070681 0.851763 -0.161150 -0.230391 -0.423944 -0.437014 -0.261928 -0.323460 0.150799 -0.178869 -0.283452 -0.256147 -0.338947 0.065280 0.146121 0.091804 0.029332 0.407120 0.011303 -0.256923 -0.132972 -0.093943 0.337634 -0.134337 0.363177 0.016173 -0.218242 -0.128976 0.149464 0.139624 0.122679 0.119802 0.128287 0.096803 0.102944 0.082848 0.093654 0.082352 0.113165 0.108866 0.120380
qa: -0.0707 0.8518 -0.1611 -0.2304 -0.4239 -0.4370 -0.2619 -0.3235 0.1508 -0.1789 -0.2835 -0.2561 -0.3389 0.0653 0.1461 0.0918 0.0293 0.4071 0.0113 -0.2569 -0.1330 -0.0939 0.3376 -0.1343 0.3632 0.0162 -0.2182 -0.1290 0.1495 0.1396 0.1227 0.1198 0.1283 0.0968 0.1029 0.0828 0.0937 0.0824 0.1132 0.1089 0.1204
va: 1.2669 5.8529 1.1408 2.2074 2.1024 2.0583 2.1108 2.1784 3.3550 3.1211 2.7927 3.1101 3.0251 4.1699 4.0448 3.8333 3.8122 4.1836 4.0170 3.9049 4.0507 3.9709 4.2382 3.9691 4.2250 3.8470 3.9570 3.8896 1.0573 1.0152 1.0232 1.0113 0.9998 1.0009 0.9995 1.0070 1.0059 1.0066 0.9944 0.9952 0.9970
dispcorr: -0.024482345 hartree
energy: -2187.693161683030
dipole: -0.21733 -1.45042 -1.66775 -27.61697 26.48037 -1.13660 9.57023 -7.12536 2.44487
magnitude: 3.17027 au
magnitude: 8.05819 debye
