program: Orca
programVersion: 5.0.2
elementType: Cl S F O O O O O N N N N N C C C C C C C C C C C C C C C H H H H H H H H H H H H H
charge: 0
multiplicity: 1
keywords: wb97x-d3
keywords: def2-TZVPP
keywords: def2/J RIJCOSX
keywords: DEFGRID2
keywords: scfconv7
keywords: smallprint printgap noloewdin
keywords: NOSOSCF
formula: C15H13ClFN5O5S
InChI: InChI=1/C15H13ClFN5O5S/c1-3-27-15-18-10(17)7-11-19-14(20-22(11)15)28(24,25)21-12-8(13(23)26-2)5-4-6-9(12)16/h4-7,21H,3H2,1-2H3
41 atoms
Cl -0.103798 -0.855091 -2.196102
S  0.6673 -1.017533 1.692762
F  -3.647807 3.867472 -1.656824
O  -4.421621 -0.244492 0.057014
O  0.022205 -2.120849 2.350835
O  1.648289 -0.165821 2.31338
O  4.710454 0.106391 1.594261
O  4.031176 -2.006875 1.318158
N  -2.375881 0.658395 0.248357
N  1.340077 -1.61895 0.298277
N  -1.824727 -0.381345 0.889564
N  -0.298848 1.265112 0.561683
N  -4.04014 1.841725 -0.813513
C  -0.598955 0.04986 1.042254
C  -1.443201 1.655417 0.048798
C  2.054925 -0.775776 -0.567299
C  3.333794 -0.32915 -0.228831
C  -3.656829 0.775702 -0.192008
C  1.491704 -0.340613 -1.767062
C  -1.856117 2.820641 -0.621691
C  3.999517 0.554437 -1.068551
C  2.175981 0.499393 -2.626384
C  -3.157583 2.823355 -1.013363
C  3.431635 0.954152 -2.265932
C  4.032355 -0.857907 0.983949
C  -5.788204 -0.190532 -0.388463
C  -6.440962 -1.489462 0.009622
C  5.410419 -0.265126 2.774131
H  0.793701 -2.360839 -0.120614
H  -1.174474 3.63553 -0.804897
H  4.980433 0.915864 -0.79518
H  1.718993 0.807711 -3.556136
H  3.967466 1.624635 -2.923294
H  -6.281807 0.66749 0.071334
H  -5.808068 -0.042824 -1.469775
H  -7.481321 -1.479804 -0.313323
H  -5.952298 -2.343216 -0.45725
H  -6.425108 -1.631356 1.089173
H  4.726065 -0.648575 3.530309
H  5.882973 0.642525 3.138683
H  6.172077 -1.018573 2.571978
totalener: -2187.67004641 hartree
nucrepener: 3172.76686051 hartree
electener: -5360.43690692 hartree
oneelecener: -9314.89889515 hartree
twoeener: 3954.46198822 hartree
kineticenergy: 2181.08313469 hartree
xcener: -161.662833470611 hartree
chargesum: 0.0000000
charge: -0.077990 0.848244 -0.161724 -0.229577 -0.428215 -0.435327 -0.261525 -0.326083 0.156685 -0.182568 -0.259725 -0.281991 -0.342086 0.059156 0.164732 0.098931 0.029007 0.404730 0.012029 -0.269354 -0.137790 -0.086870 0.340967 -0.130177 0.362820 0.021629 -0.221390 -0.129776 0.149720 0.137800 0.122639 0.121463 0.129399 0.098374 0.098161 0.081982 0.089457 0.092087 0.119791 0.114126 0.108240
qa: -0.0780 0.8482 -0.1617 -0.2296 -0.4282 -0.4353 -0.2615 -0.3261 0.1567 -0.1826 -0.2597 -0.2820 -0.3421 0.0592 0.1647 0.0989 0.0290 0.4047 0.0120 -0.2694 -0.1378 -0.0869 0.3410 -0.1302 0.3628 0.0216 -0.2214 -0.1298 0.1497 0.1378 0.1226 0.1215 0.1294 0.0984 0.0982 0.0820 0.0895 0.0921 0.1198 0.1141 0.1082
va: 1.2576 5.8624 1.1404 2.2162 2.0924 2.0649 2.1119 2.1757 3.3526 3.1228 2.8400 3.0589 3.0223 4.1858 4.0259 3.8384 3.8056 4.1947 4.0204 3.9039 4.0548 3.9819 4.2364 3.9779 4.2240 3.8440 3.9561 3.8911 1.0568 1.0155 1.0235 1.0101 0.9998 1.0000 0.9999 1.0062 1.0062 1.0059 0.9968 0.9943 0.9950
dispcorr: -0.023367194 hartree
energy: -2187.693413607894
dipole: -0.43486 -0.61798 -1.05284 -4.40352 5.45091 1.04739 4.21453 -5.89645 -1.68191
magnitude: 2.24373 au
magnitude: 5.70311 debye
