program: Orca
programVersion: 5.0.2
elementType: Cl S F O O O O O N N N N N C C C C C C C C C C C C C C C H H H H H H H H H H H H H
charge: 0
multiplicity: 1
keywords: wb97x-d3
keywords: def2-TZVPP
keywords: def2/J RIJCOSX
keywords: DEFGRID2
keywords: scfconv7
keywords: smallprint printgap noloewdin
keywords: NOSOSCF
formula: C15H13ClFN5O5S
InChI: InChI=1/C15H13ClFN5O5S/c1-3-27-15-18-10(17)7-11-19-14(20-22(11)15)28(24,25)21-12-8(13(23)26-2)5-4-6-9(12)16/h4-7,21H,3H2,1-2H3
41 atoms
Cl 0.968686 2.031609 1.160206
S  0.522381 -1.906537 1.040997
F  -3.613315 3.039063 -2.432617
O  -3.782274 1.281817 1.731786
O  0.938015 -2.788695 -0.016852
O  0.079601 -2.363105 2.330792
O  3.800108 -2.586754 0.709449
O  3.96169 -2.815303 -1.506146
N  -2.239724 0.532737 0.285216
N  1.757845 -0.824716 1.329579
N  -1.666254 -0.333882 1.132248
N  -0.628558 -0.369078 -0.885151
N  -3.708621 2.173512 -0.380881
C  -0.724337 -0.828482 0.370865
C  -1.601557 0.511646 -0.938128
C  2.35598 -0.120434 0.270605
C  3.222647 -0.743889 -0.632286
C  -3.285541 1.365459 0.534574
C  2.066337 1.233963 0.082329
C  -2.065802 1.381167 -1.941214
C  3.729341 -0.021071 -1.70667
C  2.617744 1.961928 -0.954413
C  -3.108184 2.172237 -1.572778
C  3.445117 1.322865 -1.860805
C  3.672991 -2.168758 -0.537502
C  -4.912992 2.106978 2.0670
C  -6.208605 1.534962 1.54001
C  4.145389 -3.953821 0.886866
H  1.599765 -0.297212 2.17993
H  -1.609131 1.407828 -2.917516
H  4.368787 -0.525476 -2.417146
H  2.380863 3.011373 -1.060393
H  3.865646 1.876932 -2.688517
H  -4.905431 2.124438 3.154803
H  -4.747825 3.120944 1.700743
H  -7.038407 2.135057 1.914129
H  -6.249571 1.556406 0.452558
H  -6.358196 0.511274 1.881422
H  4.167295 -4.116956 1.960729
H  5.123525 -4.180972 0.462441
H  3.400773 -4.608153 0.434021
totalener: -2187.66970882 hartree
nucrepener: 3196.60054718 hartree
electener: -5384.27025600 hartree
oneelecener: -9362.27522977 hartree
twoeener: 3978.00497377 hartree
kineticenergy: 2181.07500940 hartree
xcener: -161.662145492295 hartree
chargesum: 0.0000000
charge: -0.080406 0.842475 -0.162086 -0.234301 -0.431534 -0.434871 -0.253044 -0.355888 0.154097 -0.185612 -0.257286 -0.281924 -0.353580 0.064871 0.165477 0.081060 0.000391 0.414338 0.021968 -0.265714 -0.116957 -0.090280 0.339988 -0.124718 0.390443 0.038971 -0.262959 -0.140056 0.147853 0.139122 0.131316 0.121734 0.131544 0.113818 0.095575 0.088204 0.100246 0.096302 0.115421 0.112981 0.123019
qa: -0.0804 0.8425 -0.1621 -0.2343 -0.4315 -0.4349 -0.2530 -0.3559 0.1541 -0.1856 -0.2573 -0.2819 -0.3536 0.0649 0.1655 0.0811 0.0004 0.4143 0.0220 -0.2657 -0.1170 -0.0903 0.3400 -0.1247 0.3904 0.0390 -0.2630 -0.1401 0.1479 0.1391 0.1313 0.1217 0.1315 0.1138 0.0956 0.0882 0.1002 0.0963 0.1154 0.1130 0.1230
va: 1.2572 5.8408 1.1409 2.2214 2.0668 2.0821 2.1301 2.1468 3.3554 3.1153 2.8375 3.0567 2.9984 4.1904 4.0277 3.8211 3.8613 4.1800 3.9904 3.8938 4.0198 3.9826 4.2294 3.9560 4.2095 3.8265 3.9285 3.8920 1.0620 1.0153 1.0220 1.0102 0.9994 0.9914 1.0109 1.0097 1.0099 1.0036 0.9953 0.9949 0.9971
dispcorr: -0.024317723 hartree
energy: -2187.694026543196
dipole: -3.69326 2.69388 -0.99937 -3.91231 6.15268 2.24038 4.22559 -3.83117 0.39442
magnitude: 2.48467 au
magnitude: 6.31554 debye
