program: Gaussian 09
title: 000073843
version: EM64L-G09RevD.01
frameworkgroup: C1[X(C9H11Cl)]
method: RPBEPBE
basis: SDD
operation: Freq
keyword: #pfreq=noraman
keyword: PBEPBE/SDD
title: #p freq=noraman PBEPBE/SDD
converged: NO NO NO NO
title: Mulliken charges:
elementType: Cl C C C C C C C C C H H H H H H H H H H H
charge: -0.094596 0.492175 -0.531110 0.534109 -0.394615 -0.394639 -0.361537 -0.361545 -0.668358 -0.772980 0.210138 0.210139 0.233410 0.233405 0.233916 0.233918 0.224092 0.217930 0.224092 0.266027 0.266027
chargesum: 0.00000
title: Mulliken charges with hydrogens summed into heavy atoms:
elementType: Cl C C C C C C C C C
charge: -0.094596 0.492175 -0.110833 0.534109 -0.161205 -0.161234 -0.127620 -0.127626 -0.002242 -0.240926
polarizability: 1.51945957e+02 1.57205011e-03 9.58132002e+01 -1.72969030e+00 1.80165550e-02 7.18289654e+01
1716.lowfreq: -11.2633 -2.5957 -0.0028 -0.0023 0.0020 5.1561 29.4257 45.0990 60.0645
frequency: 29.3612 44.4833 59.9855 148.3218 212.6743 229.5710 288.6855 372.9106 393.5561 403.4297 451.8398 548.9471 618.9792 636.4995 710.2909 757.9634 787.2748 818.2864 849.6614 851.3692 901.6113 960.8423 967.8912 975.6451 1012.5160 1045.4686 1061.8585 1108.8610 1138.2219 1190.4417 1216.9505 1232.5770 1241.9029 1245.3128 1310.5959 1318.9013 1384.3478 1390.4563 1413.4723 1459.3550 1472.1005 1473.3652 1489.2775 1507.6439 1580.5098 1621.5409 2978.0744 2986.0222 3038.5720 3062.7967 3077.8664 3082.6591 3112.2996 3113.7498 3134.2769 3140.5203 3145.3727
redmass: 2.3768 4.4017 5.6654 5.1805 1.1701 4.8054 1.8630 2.1629 5.0696 2.8182 4.2874 3.6284 3.5344 6.5955 3.7977 3.3251 1.1625 4.2299 1.2495 1.7314 1.5253 1.3448 2.4132 1.3832 2.8346 1.4386 2.0245 1.1777 1.1374 1.1141 2.4031 2.6320 1.2626 1.2385 1.5074 1.2531 5.8523 1.1948 2.7991 1.1249 1.0426 1.0718 1.0928 2.6145 6.5621 6.3753 1.0348 1.0596 1.1020 1.0573 1.1003 1.1013 1.0872 1.0874 1.0966 1.0976 1.1114
irintensity: 0.5889 0.6893 0.9659 2.1352 0.2580 2.3530 0.8791 0.0597 11.1431 0.0029 5.7592 27.1577 87.4024 0.0018 12.5478 1.5961 2.7739 13.6959 0.0061 42.4443 0.0786 0.5497 5.8503 0.0158 1.3670 3.9993 23.3251 3.9712 4.4412 3.9621 0.0290 23.7414 0.1595 37.9897 1.0296 0.0135 0.1942 9.2897 6.4614 5.9397 14.9560 1.9735 9.4429 10.0671 0.1282 22.7649 37.6971 37.3040 7.8213 25.2544 56.0871 39.3343 2.0399 22.7231 34.9009 0.3488 9.7754
temp: 298.150 k
press: 1.00000 atm
elementType: 17 6 6 6 6 6 6 6 6 6 1 1 1 1 1 1 1 1 1 1 1
symmnumber: 1
zpe: 453432.3 jmol-1
zpe.correction: 0.172703 hartree
zpe.thermalcorrener: 0.182872 hartree
zpe.thermalcorrenthalpy: 0.183816 hartree
zpe.thermalcorrgfe: 0.135014 hartree
zpe.sumelectzpe: -808.880396 hartree
zpe.sumelectthermal: -808.870227 hartree
zpe.sumelectthermalent: -808.869283 hartree
zpe.sumelectthermalfe: -808.918086 hartree
dipole: 2.4780 0.0015 -1.7756
dipole: 3.0485
quadrupole: -67.8613 -61.1658 -70.4134
quadrupole: -0.0061 6.7943 0.0077
quadrupole: -1.3811 5.3144 -3.9332 -0.0061 6.7943 0.0077
hfenergy: -809.0530992 hartree
pointgroup: C01 [X(C9H11Cl1)]
dipole: -0.9184151 -0.0002933 -0.7713768 debye
dipolederiv: -0.6413552 -0.0000697 -0.1685622 -0.000234 -0.1867832 -0.0001354 -0.5949233 -0.0001366 -0.526581 0.4194181 -0.000038 -0.0717275 -0.000049 -0.0073324 -0.0000313 -0.0825323 -0.0000264 -0.070236 0.0118904 0.0000355 0.0558345 0.0001586 0.1536196 -0.000047 0.2248955 -0.0000429 0.0645478 -0.3039745 -0.00001 -0.0061477 0.0000438 -0.0510129 -0.0000295 0.1650827 -0.000021 -0.1165952 -0.2237645 -0.0892881 0.0084982 -0.1955289 0.0553134 -0.0128231 0.0046255 0.0062279 -0.1484498 -0.2237705 0.0893005 0.0084375 0.1955275 0.0553445 0.0126899 0.0044931 -0.0063724 -0.1484507 0.0616563 0.0672148 -0.0017898 -0.0201035 0.0739318 -0.0247113 0.0023229 0.0100436 -0.1324126 0.0616606 -0.0672132 -0.0017441 0.0201116 0.0739278 0.0245757 0.0022949 -0.0101819 -0.1324219 -0.0331825 0.0000117 0.0355405 -0.000049 0.0736625 -0.0000404 -0.093198 -0.0000427 0.0047449 0.9081381 0.0001185 0.2761712 0.0002078 0.1789322 0.000184 0.5193167 0.0001852 0.6537043 -0.0109923 0.0295222 -0.0191482 0.0959347 -0.071584 0.1226436 -0.0418435 0.0803437 -0.0043133 -0.0109608 -0.0295325 -0.0191024 -0.0959923 -0.0718025 -0.1225765 -0.041741 -0.0802809 -0.0041111 0.0125659 0.1057585 -0.0112706 0.1015093 -0.0520965 0.0010141 -0.001439 -0.0004356 0.1428221 0.0125645 -0.105774 -0.0111984 -0.1015074 -0.0521131 -0.0008853 -0.001363 0.0005672 0.1428245 0.0185877 -0.1009628 0.0127484 -0.0875369 -0.0457215 0.0022316 -0.0036508 0.0017001 0.1408625 0.0185781 0.100976 0.012683 0.0875367 -0.0457111 -0.0021063 -0.0037108 -0.0015711 0.1408671 0.0842683 0.0860675 -0.0454433 0.0516435 -0.0681286 0.1129957 -0.0244707 0.0630509 0.0072505 -0.2604347 0.0000316 0.0495053 0.000047 0.1073279 -0.0000272 0.0734652 -0.0000238 0.0545543 0.0842584 -0.086122 -0.0453634 -0.0516912 -0.068303 -0.1129141 -0.0244423 -0.0629685 0.007437 0.0074197 -0.016334 -0.0289522 -0.0988587 -0.0256825 0.0844709 -0.0415594 0.0563143 -0.0380744 0.007429 0.0163073 -0.0289689 0.0988304 -0.0257885 -0.0844781 -0.0416226 -0.056329 -0.0379689 unknown
polarizability: 151.2086352|0.002999|95.8132122|7.8434817|-0.0061252|72.5662754 unknown
InChI: InChI=1S/C9H11Cl/c1-2-8-3-5-9(7-10)6-4-8/h3-6H,2,7H2,1H3
charge 0 multiplicity 1
21 atoms
Cl 3.662578 0.000574 1.390537
C  -1.448263 -0.00018 -0.32797
C  -2.968728 -0.00017 -0.2507
C  1.418795 -0.000134 -0.360301
C  -0.71714 1.217398 -0.339104
C  -0.717093 -1.21772 -0.338306
C  0.692478 1.219612 -0.354062
C  0.692521 -1.219913 -0.353267
C  -3.476483 0.000591 1.218098
C  2.916272 -0.000122 -0.385442
H  -3.372088 0.889994 -0.770545
H  -3.372055 -0.890891 -0.769613
H  -1.262749 2.169601 -0.342485
H  -1.262678 -2.169948 -0.34104
H  1.239126 2.170848 -0.358327
H  1.23921 -2.171123 -0.356904
H  -3.112967 -0.891149 1.760519
H  -4.581649 0.000646 1.25148
H  -3.112917 0.892863 1.759614
H  3.341003 0.906299 -0.839736
H  3.341026 -0.906875 -0.839044
