program: Orca
programVersion: 5.0.2
elementType: Cl S F O O O O O N N N N N C C C C C C C C C C C C C C C H H H H H H H H H H H H H
charge: 0
multiplicity: 1
keywords: wb97x-d3
keywords: def2-TZVPP
keywords: def2/J RIJCOSX
keywords: DEFGRID2
keywords: scfconv7
keywords: smallprint printgap noloewdin
keywords: NOSOSCF
formula: C15H13ClFN5O5S
InChI: InChI=1/C15H13ClFN5O5S/c1-3-27-15-18-10(17)7-11-19-14(20-22(11)15)28(24,25)21-12-8(13(23)26-2)5-4-6-9(12)16/h4-7,21H,3H2,1-2H3
41 atoms
Cl 4.600191 1.291901 0.389653
S  1.348523 0.961387 1.968165
F  -5.422782 -1.402246 0.392061
O  -2.547469 1.387329 -1.69757
O  1.47496 0.710158 3.380599
O  1.662022 2.229626 1.363621
O  0.921082 -2.643677 0.31044
O  -0.636462 -1.746499 -1.01761
N  -1.977235 0.504769 0.284009
N  2.175997 -0.280511 1.220211
N  -0.774102 1.085802 0.347239
N  -1.089809 -0.302498 2.112315
N  -4.010138 -0.030816 -0.649659
C  -0.306516 0.562927 1.451446
C  -2.168357 -0.33427 1.358557
C  2.432911 -0.214893 -0.162922
C  1.574724 -0.865965 -1.051206
C  -2.890075 0.609463 -0.716985
C  3.488756 0.535196 -0.679718
C  -3.390114 -1.025719 1.445998
C  1.72715 -0.702354 -2.420731
C  3.668761 0.661865 -2.047591
C  -4.241389 -0.810046 0.407538
C  2.774874 0.056184 -2.913732
C  0.484704 -1.77196 -0.580152
C  -3.447555 1.506505 -2.812264
C  -2.76393 2.361142 -3.849467
C  -0.034215 -3.540899 0.867991
H  2.847763 -0.731328 1.82804
H  -3.615929 -1.674011 2.277368
H  1.034756 -1.184388 -3.097074
H  4.494746 1.24681 -2.426951
H  2.90433 0.17285 -3.981035
H  -3.67715 0.511677 -3.198033
H  -4.383317 1.953879 -2.471413
H  -3.420118 2.470363 -4.712459
H  -2.541372 3.356441 -3.467448
H  -1.833985 1.906916 -4.188757
H  -0.779906 -3.002048 1.452252
H  0.527843 -4.199752 1.523893
H  -0.533087 -4.128418 0.097276
totalener: -2187.66749629 hartree
nucrepener: 3257.23595613 hartree
electener: -5444.90345242 hartree
oneelecener: -9483.91218180 hartree
twoeener: 4039.00872938 hartree
kineticenergy: 2181.07697432 hartree
xcener: -161.660561829105 hartree
chargesum: -0.0000000
charge: -0.038700 0.817932 -0.163635 -0.230368 -0.440760 -0.413151 -0.239526 -0.385594 0.158612 -0.239245 -0.270693 -0.296598 -0.342812 0.110394 0.159562 0.046689 0.075486 0.428965 0.034275 -0.280549 -0.144840 -0.104466 0.353269 -0.121416 0.377881 0.020893 -0.224337 -0.126466 0.157438 0.138081 0.125716 0.122922 0.130060 0.098307 0.098927 0.081269 0.092187 0.087111 0.112660 0.121604 0.112916
qa: -0.0387 0.8179 -0.1636 -0.2304 -0.4408 -0.4132 -0.2395 -0.3856 0.1586 -0.2392 -0.2707 -0.2966 -0.3428 0.1104 0.1596 0.0467 0.0755 0.4290 0.0343 -0.2805 -0.1448 -0.1045 0.3533 -0.1214 0.3779 0.0209 -0.2243 -0.1265 0.1574 0.1381 0.1257 0.1229 0.1301 0.0983 0.0989 0.0813 0.0922 0.0871 0.1127 0.1216 0.1129
va: 1.2882 5.8703 1.1399 2.2166 2.0758 2.0777 2.1521 2.0977 3.3698 3.0443 2.8288 3.0934 3.0208 4.0975 4.0109 3.9303 3.6752 4.1674 4.0369 3.8880 4.0115 3.9938 4.2398 3.9621 4.1856 3.8489 3.9580 3.8889 1.0375 1.0143 1.0182 1.0130 0.9997 1.0009 0.9992 1.0064 1.0055 1.0061 0.9927 0.9968 0.9956
dispcorr: -0.025885762 hartree
energy: -2187.693382047989
dipole: -9.43316 8.92886 -0.50429 -4.10469 3.02075 -1.08394 -20.16132 17.98239 -2.17894
magnitude: 2.48536 au
magnitude: 6.31728 debye
