program: Orca
programVersion: 5.0.2
elementType: Cl S F O O O O O N N N N N C C C C C C C C C C C C C C C H H H H H H H H H H H H H
charge: 0
multiplicity: 1
keywords: wb97x-d3
keywords: def2-TZVPP
keywords: def2/J RIJCOSX
keywords: DEFGRID2
keywords: scfconv7
keywords: smallprint printgap noloewdin
keywords: NOSOSCF
formula: C15H13ClFN5O5S
InChI: InChI=1/C15H13ClFN5O5S/c1-3-27-15-18-10(17)7-11-19-14(20-22(11)15)28(24,25)21-12-8(13(23)26-2)5-4-6-9(12)16/h4-7,21H,3H2,1-2H3
41 atoms
Cl 4.535074 1.213518 0.146928
S  1.424297 0.938054 2.039909
F  -5.394907 -1.144688 0.278239
O  -2.213346 1.216856 -1.892865
O  1.48496 0.633138 3.443823
O  1.844463 2.185816 1.464764
O  0.677439 -2.537421 0.703129
O  -0.78701 -1.949321 -0.874272
N  -1.852284 0.57728 0.225897
N  2.254668 -0.29439 1.27153
N  -0.615553 1.082397 0.307578
N  -1.134025 -0.077992 2.185322
N  -3.839314 0.03149 -0.797355
C  -0.251573 0.658917 1.492398
C  -2.165977 -0.123864 1.368192
C  2.320283 -0.311371 -0.13607
C  1.393618 -1.004677 -0.928647
C  -2.680207 0.59919 -0.852109
C  3.323567 0.421689 -0.771797
C  -3.428428 -0.738316 1.439566
C  1.45312 -0.916875 -2.313443
C  3.384017 0.492787 -2.155451
C  -4.189475 -0.606407 0.319558
C  2.444182 -0.169947 -2.923242
C  0.302253 -1.853827 -0.372624
C  -2.997128 1.201813 -3.098123
C  -2.140833 1.781827 -4.195404
C  -0.292235 -3.393371 1.306368
H  2.098097 -1.188424 1.719385
H  -3.747143 -1.276877 2.317656
H  0.719718 -1.441822 -2.909532
H  4.17141 1.066771 -2.623349
H  2.492959 -0.109068 -4.001789
H  -3.296437 0.176398 -3.320991
H  -3.905929 1.785807 -2.940262
H  -1.843617 2.806292 -3.976335
H  -1.241099 1.187851 -4.350615
H  -2.706918 1.786498 -5.126359
H  -1.134863 -2.82281 1.692983
H  0.219147 -3.883283 2.129556
H  -0.65196 -4.140398 0.600103
totalener: -2187.67047896 hartree
nucrepener: 3292.14964748 hartree
electener: -5479.82012644 hartree
oneelecener: -9553.22392322 hartree
twoeener: 4073.40379678 hartree
kineticenergy: 2181.06925677 hartree
xcener: -161.661955136277 hartree
chargesum: 0.0000000
charge: -0.026378 0.836783 -0.162100 -0.230567 -0.430867 -0.413908 -0.283212 -0.374741 0.146434 -0.224056 -0.276571 -0.282469 -0.339933 0.075871 0.147295 0.058085 0.051722 0.432401 0.035628 -0.279863 -0.138071 -0.095726 0.357403 -0.125028 0.373954 0.016695 -0.220760 -0.120471 0.160779 0.141228 0.125703 0.119300 0.129320 0.098880 0.102539 0.093135 0.081690 0.082783 0.116597 0.121843 0.118653
qa: -0.0264 0.8368 -0.1621 -0.2306 -0.4309 -0.4139 -0.2832 -0.3747 0.1464 -0.2241 -0.2766 -0.2825 -0.3399 0.0759 0.1473 0.0581 0.0517 0.4324 0.0356 -0.2799 -0.1381 -0.0957 0.3574 -0.1250 0.3740 0.0167 -0.2208 -0.1205 0.1608 0.1412 0.1257 0.1193 0.1293 0.0989 0.1025 0.0931 0.0817 0.0828 0.1166 0.1218 0.1187
va: 1.2942 5.8788 1.1428 2.2130 2.0902 2.0845 2.1131 2.1010 3.3771 3.0579 2.8207 3.0832 3.0191 4.1266 4.0122 3.8564 3.6536 4.1596 4.1054 3.8744 3.9955 4.0133 4.2390 3.9612 4.1320 3.8487 3.9584 3.8794 1.0613 1.0129 1.0224 1.0175 1.0004 1.0018 0.9988 1.0055 1.0063 1.0072 0.9892 0.9957 0.9957
dispcorr: -0.027117302 hartree
energy: -2187.697596262428
dipole: -9.33529 8.30813 -1.02716 -6.48099 5.17024 -1.31075 -20.03296 17.78185 -2.25111
magnitude: 2.80012 au
magnitude: 7.11733 debye
