program: Orca
programVersion: 5.0.2
elementType: Cl S F O O O O O N N N N N C C C C C C C C C C C C C C C H H H H H H H H H H H H H
charge: 0
multiplicity: 1
keywords: wb97x-d3
keywords: def2-TZVPP
keywords: def2/J RIJCOSX
keywords: DEFGRID2
keywords: scfconv7
keywords: smallprint printgap noloewdin
keywords: NOSOSCF
formula: C15H13ClFN5O5S
InChI: InChI=1/C15H13ClFN5O5S/c1-3-27-15-18-10(17)7-11-19-14(20-22(11)15)28(24,25)21-12-8(13(23)26-2)5-4-6-9(12)16/h4-7,21H,3H2,1-2H3
41 atoms
Cl 0.77582 1.804114 -1.569922
S  1.245408 0.160156 2.016031
F  -4.748976 3.240378 -0.848734
O  -3.098854 -0.971116 -0.906312
O  1.194024 -1.261992 2.236938
O  1.682862 1.111863 2.999796
O  3.945409 -1.581267 1.286016
O  3.132199 -3.574106 0.696451
N  -2.05742 0.603372 0.300021
N  2.177215 0.436252 0.661639
N  -1.059561 -0.188635 0.711862
N  -0.806192 1.914273 1.524526
N  -3.947856 1.161939 -0.884732
C  -0.359681 0.653991 1.428337
C  -1.899525 1.881122 0.795603
C  2.015475 -0.350331 -0.489222
C  2.460904 -1.675939 -0.543519
C  -3.081719 0.271295 -0.529708
C  1.374527 0.179696 -1.612815
C  -2.853404 2.848493 0.43037
C  2.227628 -2.429875 -1.688334
C  1.192768 -0.559082 -2.766634
C  -3.822918 2.404652 -0.413865
C  1.615141 -1.875909 -2.796702
C  3.189427 -2.383282 0.558575
C  -4.098786 -1.397925 -1.847573
C  -3.720978 -1.035776 -3.265101
C  4.593831 -2.167762 2.407117
H  2.351213 1.423189 0.514276
H  -2.789934 3.864763 0.784562
H  2.549462 -3.461375 -1.705655
H  0.709261 -0.109175 -3.622612
H  1.464851 -2.469113 -3.688089
H  -4.135927 -2.477056 -1.714275
H  -5.067389 -0.978785 -1.573173
H  -3.72609 0.041398 -3.422327
H  -2.738269 -1.42897 -3.523466
H  -4.44666 -1.473542 -3.950714
H  5.109802 -1.354213 2.909093
H  5.314755 -2.926928 2.103275
H  3.871253 -2.616119 3.088643
totalener: -2187.66934585 hartree
nucrepener: 3237.58322002 hartree
electener: -5425.25256586 hartree
oneelecener: -9444.03211103 hartree
twoeener: 4018.77954517 hartree
kineticenergy: 2181.08201466 hartree
xcener: -161.663903115501 hartree
chargesum: -0.0000000
charge: -0.072691 0.839129 -0.161906 -0.232980 -0.434924 -0.430313 -0.254713 -0.357496 0.153654 -0.185281 -0.276167 -0.260417 -0.351686 0.076324 0.144840 0.090371 -0.003838 0.416197 0.005236 -0.257542 -0.107271 -0.094877 0.336732 -0.126403 0.395472 0.038953 -0.263548 -0.140936 0.148416 0.139520 0.130994 0.120876 0.130470 0.114589 0.097132 0.099629 0.089801 0.091063 0.117290 0.113367 0.122933
qa: -0.0727 0.8391 -0.1619 -0.2330 -0.4349 -0.4303 -0.2547 -0.3575 0.1537 -0.1853 -0.2762 -0.2604 -0.3517 0.0763 0.1448 0.0904 -0.0038 0.4162 0.0052 -0.2575 -0.1073 -0.0949 0.3367 -0.1264 0.3955 0.0390 -0.2635 -0.1409 0.1484 0.1395 0.1310 0.1209 0.1305 0.1146 0.0971 0.0996 0.0898 0.0911 0.1173 0.1134 0.1229
va: 1.2651 5.8370 1.1407 2.2192 2.0597 2.0933 2.1329 2.1448 3.3495 3.1140 2.7971 3.1070 3.0009 4.1822 4.0476 3.8192 3.8679 4.1718 3.9919 3.9012 4.0132 3.9679 4.2324 3.9537 4.2043 3.8288 3.9307 3.8913 1.0598 1.0155 1.0234 1.0109 0.9997 0.9915 1.0107 1.0096 1.0040 1.0104 0.9954 0.9946 0.9974
dispcorr: -0.024937523 hartree
energy: -2187.694283370055
dipole: 2.14991 -3.25171 -1.10180 -18.68280 18.81833 0.13553 -9.73209 7.45506 -2.27703
magnitude: 2.53322 au
magnitude: 6.43893 debye
