program: Orca
programVersion: 5.0.2
elementType: Cl S F O O O O O N N N N N C C C C C C C C C C C C C C C H H H H H H H H H H H H H
charge: 0
multiplicity: 1
keywords: wb97x-d3
keywords: def2-TZVPP
keywords: def2/J RIJCOSX
keywords: DEFGRID2
keywords: scfconv7
keywords: smallprint printgap noloewdin
keywords: NOSOSCF
formula: C15H13ClFN5O5S
InChI: InChI=1/C15H13ClFN5O5S/c1-3-27-15-18-10(17)7-11-19-14(20-22(11)15)28(24,25)21-12-8(13(23)26-2)5-4-6-9(12)16/h4-7,21H,3H2,1-2H3
41 atoms
Cl 4.576982 1.298897 0.337459
S  1.398884 0.851227 2.056831
F  -5.169913 -1.563877 -0.126724
O  -2.256969 1.441373 -1.838055
O  1.419478 0.494878 3.449543
O  1.802061 2.130466 1.542324
O  0.855705 -2.626518 0.464046
O  -0.619635 -1.911379 -1.052598
N  -1.829808 0.505154 0.153003
N  2.289593 -0.32592 1.271606
N  -0.637182 1.091591 0.3208
N  -1.068897 -0.353177 2.01479
N  -3.752658 -0.067262 -0.971365
C  -0.24606 0.540501 1.441873
C  -2.087697 -0.372489 1.182013
C  2.418837 -0.26175 -0.130098
C  1.544642 -0.928101 -1.000467
C  -2.659055 0.619136 -0.918062
C  3.426718 0.533253 -0.677485
C  -3.285088 -1.106321 1.141391
C  1.656485 -0.754571 -2.373658
C  3.541138 0.689457 -2.050484
C  -4.038838 -0.900397 0.028659
C  2.650412 0.053181 -2.8953
C  0.465549 -1.846618 -0.538023
C  -3.065388 1.604074 -3.016619
C  -4.186407 2.592656 -2.796822
C  -0.097754 -3.552018 0.985934
H  2.137686 -1.245651 1.665945
H  -3.557097 -1.792367 1.927346
H  0.961442 -1.25887 -3.030537
H  4.331097 1.309788 -2.449708
H  2.739968 0.181844 -3.96512
H  -2.363681 1.966665 -3.765064
H  -3.446448 0.633864 -3.336442
H  -3.805163 3.555468 -2.458931
H  -4.708944 2.753532 -3.739916
H  -4.91349 2.22577 -2.07459
H  0.435175 -4.136204 1.730204
H  -0.47951 -4.209841 0.206543
H  -0.926955 -3.031702 1.461749
totalener: -2187.67023112 hartree
nucrepener: 3281.01532806 hartree
electener: -5468.68555918 hartree
oneelecener: -9531.08571600 hartree
twoeener: 4062.40015682 hartree
kineticenergy: 2181.08187771 hartree
xcener: -161.665365410088 hartree
chargesum: -0.0000000
charge: -0.027188 0.836171 -0.163332 -0.235386 -0.430558 -0.414896 -0.280804 -0.372623 0.149086 -0.225303 -0.270912 -0.291715 -0.352050 0.073077 0.146681 0.057059 0.047392 0.443559 0.035982 -0.272426 -0.132337 -0.095657 0.351886 -0.127989 0.376609 0.036582 -0.258633 -0.123005 0.160757 0.140456 0.126822 0.119541 0.129378 0.110027 0.096462 0.095099 0.086984 0.097680 0.124130 0.119487 0.113907
qa: -0.0272 0.8362 -0.1633 -0.2354 -0.4306 -0.4149 -0.2808 -0.3726 0.1491 -0.2253 -0.2709 -0.2917 -0.3520 0.0731 0.1467 0.0571 0.0474 0.4436 0.0360 -0.2724 -0.1323 -0.0957 0.3519 -0.1280 0.3766 0.0366 -0.2586 -0.1230 0.1608 0.1405 0.1268 0.1195 0.1294 0.1100 0.0965 0.0951 0.0870 0.0977 0.1241 0.1195 0.1139
va: 1.2931 5.8799 1.1425 2.2212 2.0901 2.0842 2.1139 2.1017 3.3773 3.0570 2.8340 3.0829 2.9961 4.1377 4.0245 3.8649 3.6496 4.1419 4.1032 3.8682 3.9946 4.0108 4.2420 3.9677 4.1305 3.8334 3.9324 3.8728 1.0609 1.0124 1.0214 1.0173 1.0004 0.9917 1.0119 1.0038 1.0098 1.0107 0.9962 0.9957 0.9929
dispcorr: -0.026886907 hartree
energy: -2187.697118028585
dipole: -14.08408 12.96694 -1.11714 -3.36248 2.25046 -1.11201 -17.02383 14.76292 -2.26092
magnitude: 2.75614 au
magnitude: 7.00555 debye
