program: Orca
programVersion: 4.2.1
elementType: O O O O O O O O N N N N C C C C C C C C C C C C C C C C C C C H H H H H H H H H H H H H H H H H H
charge: 0
multiplicity: 1
keywords: wb97x-d3
keywords: def2-TZVPP
keywords: def2/J RIJCOSX GRIDX6 NOFINALGRIDX
keywords: grid4 nofinalgrid
keywords: scfconv7
keywords: smallprint printgap noloewdin
keywords: NOSOSCF
formula: C19H18N4O8
InChI: InChI=1/C19H18N4O8/c1-26-12-8-13(27-2)21-18(20-12)30-10-6-5-7-11(16(10)17(24)25)31-19-22-14(28-3)9-15(23-19)29-4/h5-9,24H,1-4H3
49 atoms
O  1.490966 1.916484 1.191836
O  -1.447049 0.291632 -2.29707
O  0.043511 -0.395073 1.370051
O  4.293587 -1.082653 -0.810519
O  -4.19343 -0.34343 1.293367
O  4.649394 -0.090573 3.711374
O  -4.272359 -3.124425 -2.507547
O  0.081437 -1.367613 -0.635564
N  2.880537 0.442789 0.141341
N  -2.811066 0.032623 -0.485358
N  3.046568 0.941313 2.444444
N  -2.885888 -1.399296 -2.363595
C  0.019298 1.005004 -0.506977
C  0.75084 2.059875 0.042505
C  -0.744843 1.275373 -1.644661
C  0.728808 3.324901 -0.516125
C  -0.793523 2.539543 -2.202105
C  -0.049705 3.56113 -1.636125
C  0.056943 -0.373326 0.048562
C  2.519219 1.049286 1.245701
C  -2.425294 -0.390114 -1.670532
C  3.888567 -0.415297 0.257932
C  -3.760514 -0.685132 0.092234
C  4.059495 0.088824 2.540337
C  -3.847966 -2.106982 -1.771331
C  4.537783 -0.643379 1.460727
C  -4.336066 -1.800331 -0.511533
C  3.613034 -0.874825 -2.047464
C  -3.600886 0.781883 1.940989
C  4.174036 0.631984 4.844494
C  -5.274258 -3.982417 -1.975671
H  1.315714 4.116655 -0.070993
H  -1.406809 2.716962 -3.07489
H  -0.076963 4.549968 -2.071926
H  5.35564 -1.342557 1.554341
H  -5.105516 -2.366596 -0.009594
H  0.079625 -1.311846 1.686904
H  4.082724 -1.550591 -2.756706
H  2.552982 -1.113704 -1.96905
H  3.725224 0.149827 -2.400593
H  -2.526897 0.652128 2.068978
H  -3.78846 1.704565 1.392983
H  -4.076171 0.841527 2.915882
H  4.2847 1.707814 4.71244
H  3.132139 0.400616 5.063427
H  4.793097 0.309587 5.677064
H  -6.201817 -3.44299 -1.777828
H  -5.460304 -4.737878 -2.733626
H  -4.935279 -4.47335 -1.062056
elementType: O N C H
totalener: -1555.84877301 hartree
nucrepener: 3205.75497892 hartree
electener: -4761.60375193 hartree
oneelecener: -8503.43530442 hartree
twoeener: 3741.83155249 hartree
cpcmener: -0.05401666 hartree
kineticenergy: 1549.67955959 hartree
xcener: -143.543651305242 hartree
chargesum: -0.0000000
charge: -0.299784 -0.296151 -0.286653 -0.303569 -0.299723 -0.303414 -0.295521 -0.431669 -0.398009 -0.399359 -0.394429 -0.354690 0.034067 0.191971 0.194472 -0.184025 -0.182101 -0.118399 0.441255 0.354688 0.369946 0.411078 0.357275 0.426513 0.393654 -0.327337 -0.302329 -0.110093 -0.110454 -0.112762 -0.131085 0.153969 0.154013 0.167426 0.144994 0.138643 0.260301 0.135219 0.106936 0.112989 0.107286 0.113724 0.135197 0.113556 0.112707 0.132412 0.123228 0.129512 0.124529
qa: -0.2998 -0.2962 -0.2867 -0.3036 -0.2997 -0.3034 -0.2955 -0.4317 -0.3980 -0.3994 -0.3944 -0.3547 0.0341 0.1920 0.1945 -0.1840 -0.1821 -0.1184 0.4413 0.3547 0.3699 0.4111 0.3573 0.4265 0.3937 -0.3273 -0.3023 -0.1101 -0.1105 -0.1128 -0.1311 0.1540 0.1540 0.1674 0.1450 0.1386 0.2603 0.1352 0.1069 0.1130 0.1073 0.1137 0.1352 0.1136 0.1127 0.1324 0.1232 0.1295 0.1245
va: 2.0923 2.0970 2.2155 2.1162 2.1260 2.1155 2.0918 2.0373 2.9129 2.9150 2.9518 2.9758 3.5310 3.8372 3.7900 3.9822 3.9830 3.9067 4.0929 4.3158 4.2901 4.0230 4.1040 3.9936 4.1375 3.9328 3.8443 3.8389 3.8420 3.8439 3.8532 1.0006 1.0006 0.9845 1.0162 1.0168 0.9913 0.9940 1.0012 0.9968 0.9986 0.9968 0.9942 0.9964 0.9970 0.9929 0.9856 0.9933 0.9858
dispcorr: -0.025704575 hartree
energy: -1555.874477582807
dipole: -4.11866 3.08758 -1.03108 -2.67914 3.18004 0.50090 6.70370 -4.78973 1.91397
magnitude: 2.23099 au
magnitude: 5.67073 debye
