program: Orca
programVersion: 4.2.1
elementType: O O O O O O O O N N N N C C C C C C C C C C C C C C C C C C C H H H H H H H H H H H H H H H H H H
charge: 0
multiplicity: 1
keywords: wb97x-d3
keywords: def2-TZVPP
keywords: def2/J RIJCOSX GRIDX6 NOFINALGRIDX
keywords: grid4 nofinalgrid
keywords: scfconv7
keywords: smallprint printgap noloewdin
keywords: NOSOSCF
formula: C19H18N4O8
InChI: InChI=1/C19H18N4O8/c1-26-12-8-13(27-2)21-18(20-12)30-10-6-5-7-11(16(10)17(24)25)31-19-22-14(28-3)9-15(23-19)29-4/h5-9,24H,1-4H3
49 atoms
O  1.617934 0.486412 1.846751
O  -1.898479 1.19562 -1.373042
O  0.2392 -1.510684 0.685406
O  5.564054 -1.687727 2.07085
O  -4.144702 -1.580451 1.476755
O  4.65809 1.142092 -1.493257
O  -5.27396 -1.306348 -3.016053
O  -0.108999 -0.944437 -1.442374
N  3.55202 -0.600704 1.965128
N  -2.989949 -0.172504 0.092636
N  3.089888 0.831089 0.141978
N  -3.54969 -0.040686 -2.199182
C  -0.121345 0.758042 0.208698
C  0.709037 1.2868 1.195365
C  -1.06614 1.613447 -0.362418
C  0.622749 2.609355 1.587168
C  -1.179961 2.932143 0.031227
C  -0.325451 3.429411 1.002061
C  -0.00046 -0.641534 -0.278153
C  2.80723 0.233328 1.273154
C  -2.851163 0.275729 -1.131382
C  4.744769 -0.857073 1.445149
C  -3.953394 -1.070061 0.270705
C  4.291022 0.566826 -0.359268
C  -4.514326 -0.929922 -1.999544
C  5.188899 -0.288891 0.258616
C  -4.775282 -1.498063 -0.759184
C  5.129991 -2.313439 3.275122
C  -3.285579 -1.171044 2.538914
C  3.76222 2.05578 -2.122387
C  -5.039301 -0.742061 -4.303456
H  1.291599 2.988192 2.347778
H  -1.930876 3.563858 -0.422943
H  -0.403403 4.463609 1.305685
H  6.16592 -0.497026 -0.150871
H  -5.561435 -2.223354 -0.609871
H  0.340993 -2.399173 0.309091
H  5.957375 -2.942469 3.59169
H  4.91568 -1.585176 4.055745
H  4.25112 -2.935261 3.111043
H  -3.405761 -0.112565 2.767578
H  -3.586835 -1.758896 3.401508
H  -2.239385 -1.373134 2.311411
H  3.526513 2.899075 -1.47462
H  4.284411 2.41684 -3.003559
H  2.836881 1.568424 -2.426329
H  -4.039742 -0.973317 -4.669821
H  -5.773938 -1.198403 -4.960981
H  -5.182792 0.337866 -4.302868
elementType: O N C H
totalener: -1555.84771844 hartree
nucrepener: 3160.13661773 hartree
electener: -4715.98433617 hartree
oneelecener: -8412.05114692 hartree
twoeener: 3696.06681074 hartree
cpcmener: -0.04772480 hartree
kineticenergy: 1549.70956641 hartree
xcener: -143.545499870016 hartree
chargesum: -0.0000000
charge: -0.305017 -0.297739 -0.279689 -0.305465 -0.304463 -0.306192 -0.304182 -0.434331 -0.399280 -0.397123 -0.388456 -0.399677 0.026518 0.232796 0.183896 -0.185153 -0.177364 -0.123516 0.419478 0.363846 0.368026 0.424063 0.403650 0.395185 0.425835 -0.325084 -0.327280 -0.113989 -0.106548 -0.108510 -0.114105 0.155003 0.155280 0.167996 0.145301 0.145163 0.264037 0.132197 0.112871 0.113502 0.113141 0.134734 0.104558 0.111872 0.133687 0.111485 0.112927 0.132657 0.113459
qa: -0.3050 -0.2977 -0.2797 -0.3055 -0.3045 -0.3062 -0.3042 -0.4343 -0.3993 -0.3971 -0.3885 -0.3997 0.0265 0.2328 0.1839 -0.1852 -0.1774 -0.1235 0.4195 0.3638 0.3680 0.4241 0.4036 0.3952 0.4258 -0.3251 -0.3273 -0.1140 -0.1065 -0.1085 -0.1141 0.1550 0.1553 0.1680 0.1453 0.1452 0.2640 0.1322 0.1129 0.1135 0.1131 0.1347 0.1046 0.1119 0.1337 0.1115 0.1129 0.1327 0.1135
va: 2.0874 2.0917 2.2156 2.1125 2.1149 2.1124 2.1138 2.0530 2.9516 2.9189 2.9191 2.9547 3.5813 3.8189 3.8230 4.0093 3.9902 3.9064 4.2114 4.2844 4.2888 3.9951 4.0345 4.0454 3.9956 3.9246 3.9240 3.8448 3.8428 3.8454 3.8441 0.9969 0.9989 0.9842 1.0160 1.0161 0.9893 0.9932 0.9966 0.9965 0.9966 0.9936 0.9997 0.9965 0.9934 0.9955 0.9967 0.9930 0.9963
dispcorr: -0.024471669 hartree
energy: -1555.872190110176
dipole: 0.77114 -0.60045 0.17070 -0.16427 0.69629 0.53202 0.98772 0.12743 1.11515
magnitude: 1.24730 au
magnitude: 3.17037 debye
