program: Orca
programVersion: 4.2.1
elementType: O O O O O O O O N N N N C C C C C C C C C C C C C C C C C C C H H H H H H H H H H H H H H H H H H
charge: 0
multiplicity: 1
keywords: wb97x-d3
keywords: def2-TZVPP
keywords: def2/J RIJCOSX GRIDX6 NOFINALGRIDX
keywords: grid4 nofinalgrid
keywords: scfconv7
keywords: smallprint printgap noloewdin
keywords: NOSOSCF
formula: C19H18N4O8
InChI: InChI=1/C19H18N4O8/c1-26-12-8-13(27-2)21-18(20-12)30-10-6-5-7-11(16(10)17(24)25)31-19-22-14(28-3)9-15(23-19)29-4/h5-9,24H,1-4H3
49 atoms
O  1.863062 1.593053 0.400822
O  -1.738418 -0.689585 -1.839215
O  -0.070673 0.222581 1.687224
O  4.709724 -1.792776 -0.744316
O  -5.732234 -2.372011 -0.59006
O  5.27531 0.613005 3.182714
O  -4.241207 1.645974 1.189503
O  -0.474441 -1.610408 0.483057
N  3.239262 -0.121915 -0.210052
N  -3.697049 -1.535067 -1.222164
N  3.533001 1.113403 1.784411
N  -2.949236 0.5197 -0.326788
C  0.057847 0.40623 -0.647944
C  1.088647 1.342026 -0.707927
C  -0.732823 0.245693 -1.78809
C  1.338411 2.077282 -1.851751
C  -0.511555 0.98707 -2.932173
C  0.533078 1.897372 -2.962351
C  -0.190396 -0.438594 0.550489
C  2.925777 0.809904 0.65792
C  -2.840997 -0.547769 -1.080112
C  4.31734 -0.840043 0.087359
C  -4.808282 -1.427784 -0.504759
C  4.601787 0.380566 2.066567
C  -4.062875 0.603517 0.393511
C  5.061966 -0.634287 1.237593
C  -5.058494 -0.359148 0.346309
C  3.985132 -1.993455 -1.954447
C  -5.524104 -3.467242 -1.477157
C  4.811181 1.625031 4.072582
C  -3.226684 2.645063 1.253388
H  2.155678 2.785391 -1.866619
H  -1.150995 0.847989 -3.793135
H  0.717606 2.472844 -3.858549
H  5.937629 -1.221347 1.472315
H  -5.965156 -0.28196 0.928134
H  -0.213003 -0.378843 2.435546
H  4.518392 -2.775179 -2.488672
H  2.963821 -2.321874 -1.763625
H  3.962567 -1.09275 -2.566896
H  -5.424631 -3.136444 -2.510512
H  -4.647712 -4.052149 -1.200005
H  -6.410273 -4.089362 -1.386928
H  3.81373 1.401781 4.450253
H  5.513163 1.629821 4.901771
H  4.806969 2.607747 3.602334
H  -3.559106 3.351868 2.008691
H  -2.264842 2.227436 1.548837
H  -3.115027 3.164915 0.302027
elementType: O N C H
totalener: -1555.84779540 hartree
nucrepener: 3153.54940915 hartree
electener: -4709.39720455 hartree
oneelecener: -8398.90077762 hartree
twoeener: 3689.50357307 hartree
cpcmener: -0.04801088 hartree
kineticenergy: 1549.68422772 hartree
xcener: -143.540676930393 hartree
chargesum: 0.0000000
charge: -0.305054 -0.298077 -0.280392 -0.305894 -0.304102 -0.305510 -0.304556 -0.432690 -0.388362 -0.399260 -0.399106 -0.396473 0.022861 0.233928 0.181178 -0.182903 -0.174718 -0.123428 0.418617 0.365653 0.367246 0.393569 0.424113 0.423169 0.404210 -0.324298 -0.326043 -0.106970 -0.112645 -0.114108 -0.106596 0.154587 0.155406 0.167633 0.144275 0.145542 0.265458 0.132989 0.111613 0.110893 0.113033 0.112753 0.131962 0.113824 0.132599 0.112219 0.133644 0.104804 0.113406
qa: -0.3051 -0.2981 -0.2804 -0.3059 -0.3041 -0.3055 -0.3046 -0.4327 -0.3884 -0.3993 -0.3991 -0.3965 0.0229 0.2339 0.1812 -0.1829 -0.1747 -0.1234 0.4186 0.3657 0.3672 0.3936 0.4241 0.4232 0.4042 -0.3243 -0.3260 -0.1070 -0.1126 -0.1141 -0.1066 0.1546 0.1554 0.1676 0.1443 0.1455 0.2655 0.1330 0.1116 0.1109 0.1130 0.1128 0.1320 0.1138 0.1326 0.1122 0.1336 0.1048 0.1134
va: 2.0885 2.0918 2.2133 2.1114 2.1136 2.1119 2.1145 2.0554 2.9196 2.9549 2.9514 2.9198 3.6001 3.8146 3.8289 4.0086 3.9883 3.9071 4.2209 4.2814 4.2899 4.0470 3.9970 3.9956 4.0327 3.9244 3.9262 3.8462 3.8442 3.8451 3.8438 0.9968 0.9988 0.9844 1.0162 1.0160 0.9882 0.9933 0.9954 0.9963 0.9968 0.9964 0.9934 0.9966 0.9929 0.9967 0.9941 0.9990 0.9964
dispcorr: -0.024319436 hartree
energy: -1555.872114832411
dipole: 0.81706 -0.44205 0.37501 0.94104 0.27537 1.21641 0.33927 -0.52469 -0.18542
magnitude: 1.28634 au
magnitude: 3.26961 debye
