program: Orca
programVersion: 4.2.1
elementType: O O O O O O O O N N N N C C C C C C C C C C C C C C C C C C C H H H H H H H H H H H H H H H H H H
charge: 0
multiplicity: 1
keywords: wb97x-d3
keywords: def2-TZVPP
keywords: def2/J RIJCOSX GRIDX6 NOFINALGRIDX
keywords: grid4 nofinalgrid
keywords: scfconv7
keywords: smallprint printgap noloewdin
keywords: NOSOSCF
formula: C19H18N4O8
InChI: InChI=1/C19H18N4O8/c1-26-12-8-13(27-2)21-18(20-12)30-10-6-5-7-11(16(10)17(24)25)31-19-22-14(28-3)9-15(23-19)29-4/h5-9,24H,1-4H3
49 atoms
O  2.601322 1.191089 -1.27648
O  -2.059482 1.749158 -0.342837
O  -0.290169 0.717442 1.448517
O  6.043128 -0.445909 1.132889
O  -3.684051 -2.498819 -0.783434
O  2.052534 -2.806256 0.86396
O  -5.561726 0.510242 2.212044
O  1.456925 2.076119 1.16914
N  4.303736 0.396025 -0.092604
N  -2.813044 -0.394035 -0.583685
N  2.281137 -0.81637 -0.23954
N  -3.779073 1.146867 0.924601
C  0.247703 1.355125 -0.741324
C  1.284519 1.217576 -1.667463
C  -1.047036 1.478672 -1.233858
C  1.032232 1.164325 -3.023521
C  -1.316947 1.457843 -2.590626
C  -0.271481 1.293339 -3.4806
C  0.543203 1.42949 0.714422
C  3.067165 0.201541 -0.492418
C  -2.91422 0.770649 0.007889
C  4.803916 -0.558755 0.681175
C  -3.710833 -1.300557 -0.218382
C  2.794353 -1.756751 0.546035
C  -4.658958 0.222955 1.286348
C  4.083246 -1.687504 1.05079
C  -4.685399 -1.051299 0.734886
C  6.810566 0.699465 0.77016
C  -2.69666 -2.766112 -1.77498
C  0.736258 -2.904854 0.322482
C  -5.524092 1.788497 2.841296
H  1.852269 1.040968 -3.717685
H  -2.331431 1.580469 -2.943932
H  -0.469832 1.268503 -4.542965
H  4.498549 -2.456363 1.685299
H  -5.411764 -1.793945 1.029801
H  -0.079495 0.827081 2.389926
H  6.346486 1.623465 1.1133
H  7.769682 0.577553 1.265555
H  6.969082 0.754093 -0.306393
H  -1.689111 -2.726127 -1.360809
H  -2.898175 -3.774118 -2.126056
H  -2.76262 -2.072962 -2.612493
H  0.764694 -3.030206 -0.759776
H  0.295578 -3.790312 0.769614
H  0.129302 -2.034744 0.56937
H  -4.581415 1.952619 3.362483
H  -5.687903 2.597033 2.129764
H  -6.333927 1.781674 3.565562
elementType: O N C H
totalener: -1555.84804986 hartree
nucrepener: 3199.06364959 hartree
electener: -4754.91169946 hartree
oneelecener: -8489.23787688 hartree
twoeener: 3734.32617743 hartree
cpcmener: -0.04747155 hartree
kineticenergy: 1549.69391663 hartree
xcener: -143.543673790527 hartree
chargesum: 0.0000000
charge: -0.297137 -0.313496 -0.269742 -0.304026 -0.306911 -0.306020 -0.305854 -0.433469 -0.395152 -0.376040 -0.390247 -0.396325 -0.004710 0.217015 0.252858 -0.196913 -0.187022 -0.115340 0.412006 0.355462 0.367904 0.425141 0.389409 0.404656 0.420353 -0.325424 -0.323072 -0.113345 -0.095128 -0.102653 -0.113508 0.154269 0.147152 0.167006 0.145203 0.145227 0.260661 0.112973 0.132208 0.113307 0.088571 0.134809 0.114825 0.116985 0.139593 0.096380 0.112913 0.112565 0.132084
qa: -0.2971 -0.3135 -0.2697 -0.3040 -0.3069 -0.3060 -0.3059 -0.4335 -0.3952 -0.3760 -0.3902 -0.3963 -0.0047 0.2170 0.2529 -0.1969 -0.1870 -0.1153 0.4120 0.3555 0.3679 0.4251 0.3894 0.4047 0.4204 -0.3254 -0.3231 -0.1133 -0.0951 -0.1027 -0.1135 0.1543 0.1472 0.1670 0.1452 0.1452 0.2607 0.1130 0.1322 0.1133 0.0886 0.1348 0.1148 0.1170 0.1396 0.0964 0.1129 0.1126 0.1321
va: 2.0952 2.0862 2.2087 2.1141 2.1114 2.1184 2.1105 2.0556 2.9513 2.9207 2.9240 2.9491 3.6387 3.8072 3.8442 3.9995 3.9736 3.8923 4.2231 4.3044 4.2798 3.9972 4.0398 4.0187 4.0007 3.9330 3.9248 3.8441 3.8514 3.8431 3.8452 1.0003 1.0016 0.9847 1.0161 1.0162 0.9909 0.9967 0.9932 0.9963 0.9985 0.9942 0.9979 0.9936 0.9918 0.9986 0.9970 0.9964 0.9930
dispcorr: -0.025742724 hartree
energy: -1555.873792586774
dipole: -2.91716 1.78919 -1.12797 -7.88265 6.36816 -1.51449 -0.20081 -0.48631 -0.68712
magnitude: 2.00951 au
magnitude: 5.10777 debye
