program: Gaussian 09
title: 000068869
version: EM64L-G09RevD.01
frameworkgroup: C1[X(C16H12FNO3)]
method: RPBEPBE
basis: SDD
operation: Freq
keyword: #p
keyword: freq=noraman
keyword: PBEPBE/SDD
title: #p freq=noraman PBEPBE/SDD
converged: YES YES NO NO
title: Mulliken charges:
elementType: F O O O N C C C C C C C C C C C C C C C C H H H H H H H H H H H H
charge: -0.197772 -0.266092 -0.407308 -0.234284 -0.056897 -0.348792 0.549164 0.031676 -0.496483 0.232081 -0.438965 -0.359563 -0.694029 0.071351 0.327465 0.179783 -0.322527 -0.343091 -0.367422 -0.365013 0.323351 0.249680 0.290692 0.240395 0.255278 0.245698 0.229789 0.225442 0.268572 0.278764 0.260067 0.261688 0.377303
chargesum: 0.00000
title: Mulliken charges with hydrogens summed into heavy atoms:
elementType: F O O O N C C C C C C C C C C C C C C C C
charge: -0.197772 -0.266092 -0.030005 -0.234284 -0.056897 -0.099112 0.549164 0.031676 -0.205791 0.232081 -0.198570 -0.104285 0.006901 0.071351 0.327465 0.179783 -0.053955 -0.064328 -0.107355 -0.103325 0.323351
polarizability: 3.53152872e+02 -1.44049225e+01 1.79557536e+02 -5.18501234e+00 -1.05457660e+01 9.98262987e+01
1716.lowfreq: -10.6914 -4.9607 -2.6715 0.0003 0.0005 0.0008 25.4244 30.6862 43.0794
frequency: 25.1563 30.6793 43.0445 54.4896 61.7106 81.2290 122.7470 152.2660 197.1295 217.2138 228.0558 255.0974 261.3674 273.9639 338.5360 349.0823 388.7458 397.5856 412.4249 413.7337 438.9332 509.1462 512.0204 527.0618 569.8794 603.7845 622.3327 625.6623 627.5977 641.6925 679.7250 706.9925 734.2487 754.6203 766.2736 789.0349 806.5200 816.1113 824.3793 828.3088 847.1630 848.6779 913.6285 925.5648 948.3969 966.1680 976.3590 978.3052 1001.6685 1008.7687 1034.8087 1065.0800 1096.0536 1104.7360 1119.7388 1135.4991 1157.1737 1177.4882 1200.5940 1217.8335 1236.6770 1259.8942 1267.0341 1295.0445 1305.3015 1347.3011 1377.7108 1391.3900 1399.4164 1414.2241 1431.2120 1461.2238 1472.2657 1473.5115 1474.8208 1552.0352 1592.8162 1607.1464 1617.7146 1628.5708 1660.9988 2994.3853 3049.1874 3092.0468 3107.0595 3140.2357 3162.6052 3163.0874 3165.8219 3178.9593 3182.2531 3186.0356 3505.3946
redmass: 4.7401 7.4012 9.2897 4.5261 6.9070 7.2803 6.7735 5.3116 4.2466 1.0887 5.1567 6.0817 5.5349 6.1811 7.0503 6.0349 5.9121 5.4783 3.0688 5.0142 3.1348 4.4431 3.1288 6.2519 4.2150 3.7870 2.8382 5.3598 4.3329 2.3627 5.7208 4.4569 4.2417 4.6571 4.8207 4.5944 3.6343 2.9752 1.2493 1.8016 1.5948 12.0994 1.5584 3.0178 1.3622 1.3534 8.9718 1.3509 2.2455 2.5206 2.3330 1.6234 2.3248 1.3844 2.0849 2.3277 1.4339 2.0702 2.1431 2.8248 1.6563 1.5451 3.4737 1.2741 1.6591 1.9841 6.5001 1.1961 3.7468 3.7745 3.9471 2.3005 1.1807 2.2001 1.1814 7.4289 7.9313 7.1291 7.6154 7.5969 8.1874 1.0353 1.0852 1.1002 1.1005 1.0898 1.0934 1.0893 1.0888 1.0962 1.0971 1.0980 1.0638
irintensity: 0.0213 0.5571 2.4228 0.1898 0.1105 0.6863 0.8373 1.3623 0.8523 0.5016 1.6651 0.0628 1.5506 0.2415 5.4338 3.7259 5.2276 0.4603 0.3865 5.8622 3.2760 3.5045 32.1782 8.8567 6.8775 44.3796 48.9568 20.4163 20.8740 63.9870 26.4911 37.7505 6.4395 1.2122 10.1100 37.5203 10.8389 20.2415 0.9442 27.4943 78.0571 17.5135 16.4170 16.5470 1.3021 0.3786 69.3665 0.1690 15.3608 3.2485 274.6376 23.2956 42.3111 18.4362 8.7434 0.6552 91.1288 16.9353 37.9460 21.2154 11.7890 12.7939 4.4606 4.1034 0.1003 41.3066 2.8986 20.4246 7.7693 19.9518 23.9844 9.9630 33.4045 168.2895 45.9074 14.3418 11.7683 37.7604 29.1551 15.2921 175.9148 27.4618 6.4748 39.9562 16.6512 7.6826 0.1308 0.7863 2.7457 5.2764 2.0133 4.3485 24.6181
temp: 298.150 k
press: 1.00000 atm
elementType: 9 8 8 8 7 6 6 6 6 6 6 6 6 6 6 6 6 6 6 6 6 1 1 1 1 1 1 1 1 1 1 1 1
symmnumber: 1
zpe: 637643.5 jmol-1
zpe.correction: 0.242866 hartree
zpe.thermalcorrener: 0.260592 hartree
zpe.thermalcorrenthalpy: 0.261536 hartree
zpe.thermalcorrgfe: 0.194961 hartree
zpe.sumelectzpe: -995.715604 hartree
zpe.sumelectthermal: -995.697878 hartree
zpe.sumelectthermalent: -995.696934 hartree
zpe.sumelectthermalfe: -995.763508 hartree
dipole: -2.0541 2.5307 -0.2464
dipole: 3.2687
quadrupole: -118.7254 -115.6446 -118.6871
quadrupole: -3.4125 1.4855 0.9553
quadrupole: -1.0397 2.0411 -1.0014 -3.4125 1.4855 0.9553
hfenergy: -995.9584693 hartree
pointgroup: C01 [X(C16H12F1N1O3)]
dipole: 0.8173034 0.9822685 0.1449302 debye
polarizability: 353.1108469|13.8252114|177.7312821|-8.6353803|15.2556481|101.6945769 unknown
InChI: InChI=1S/C16H12FNO3/c1-9(16(19)20)11-4-7-14-13(8-11)18-15(21-14)10-2-5-12(17)6-3-10/h2-9,19H,1H3
charge 0 multiplicity 1
33 atoms
F  -6.999438 -0.696573 0.174295
O  -0.904634 1.448462 0.213469
O  5.604951 -0.638457 1.563606
O  4.724128 -2.297149 0.199467
N  -0.455365 -0.77064 -0.311364
C  4.594561 0.079344 -0.514758
C  3.12626 0.474277 -0.283495
C  0.767093 -0.055096 -0.239648
C  2.094593 -0.485848 -0.427769
C  0.49366 1.305671 0.082562
C  2.817359 1.827742 0.045325
C  1.488165 2.275786 0.23395
C  4.86484 -0.304126 -1.992365
C  -1.405658 0.119569 -0.046209
C  -2.850014 -0.071071 0.015319
C  4.960059 -1.086142 0.402516
C  -3.722991 1.011868 0.30977
C  -3.386134 -1.367197 -0.225097
C  -5.115675 0.807522 0.364201
C  -4.77554 -1.582703 -0.173105
C  -5.608889 -0.486895 0.120779
H  5.233651 0.931421 -0.227405
H  2.316274 -1.531072 -0.663698
H  3.637855 2.545015 0.159085
H  1.259668 3.314293 0.485508
H  4.290013 -1.202778 -2.272228
H  4.567668 0.52535 -2.656692
H  5.936069 -0.519176 -2.155497
H  -3.305879 2.005836 0.493374
H  -2.699652 -2.188946 -0.449433
H  -5.807821 1.623762 0.588301
H  -5.211252 -2.569211 -0.353337
H  5.789472 -1.416438 2.158074
