program: Orca
programVersion: 4.2.1
elementType: O O O O O O O O N N N N C C C C C C C C C C C C C C C C C C C H H H H H H H H H H H H H H H H H H
charge: 0
multiplicity: 1
keywords: wb97x-d3
keywords: def2-TZVPP
keywords: def2/J RIJCOSX GRIDX6 NOFINALGRIDX
keywords: grid4 nofinalgrid
keywords: scfconv7
keywords: smallprint printgap noloewdin
keywords: NOSOSCF
formula: C19H18N4O8
InChI: InChI=1/C19H18N4O8/c1-26-12-8-13(27-2)21-18(20-12)30-10-6-5-7-11(16(10)17(24)25)31-19-22-14(28-3)9-15(23-19)29-4/h5-9,24H,1-4H3
49 atoms
O  2.259174 0.789642 -1.285798
O  -2.2698 1.439139 0.292377
O  0.598898 -1.250442 -0.540761
O  2.965209 0.58147 3.222022
O  -5.549267 -1.490178 1.288542
O  5.668832 -1.736153 0.24256
O  -3.087755 -1.988773 -2.616432
O  -0.561157 -0.559932 1.233354
N  2.590918 0.74499 0.971553
N  -3.894616 0.008425 0.788635
N  3.948432 -0.45086 -0.54788
N  -2.649703 -0.243113 -1.203795
C  -0.011479 1.009741 -0.464218
C  1.110703 1.525291 -1.115746
C  -1.143793 1.824148 -0.393117
C  1.108786 2.792476 -1.66953
C  -1.169513 3.083726 -0.962266
C  -0.03698 3.566178 -1.596228
C  -0.023985 -0.331484 0.176952
C  2.954063 0.343843 -0.222264
C  -2.957356 0.339796 -0.070123
C  3.294277 0.248935 1.984583
C  -4.595101 -1.073428 0.47157
C  4.651487 -0.922753 0.474631
C  -3.35584 -1.329288 -1.500664
C  4.36574 -0.609924 1.797879
C  -4.369284 -1.808101 -0.685324
C  1.849654 1.448321 3.42807
C  -5.789471 -0.7684 2.494586
C  5.97331 -2.098152 -1.102713
C  -2.020355 -1.531819 -3.445346
H  1.999802 3.164504 -2.156666
H  -2.069011 3.680882 -0.900342
H  -0.046873 4.553958 -2.035166
H  4.934074 -1.014738 2.622234
H  -4.937216 -2.694432 -0.927669
H  0.576491 -2.103351 -0.077729
H  0.93513 1.036584 3.002946
H  1.74028 1.531121 4.505724
H  2.027848 2.438019 3.008838
H  -6.594979 -1.297406 2.996257
H  -4.911984 -0.758106 3.140397
H  -6.103059 0.255839 2.296201
H  5.143566 -2.621253 -1.577045
H  6.243435 -1.230358 -1.703387
H  6.826812 -2.767286 -1.038524
H  -2.225879 -0.544525 -3.858038
H  -1.073999 -1.50558 -2.905943
H  -1.95209 -2.25077 -4.256944
elementType: O N C H
totalener: -1555.84813132 hartree
nucrepener: 3211.83378601 hartree
electener: -4767.68191733 hartree
oneelecener: -8515.51131017 hartree
twoeener: 3747.82939285 hartree
cpcmener: -0.04572516 hartree
kineticenergy: 1549.68285477 hartree
xcener: -143.544474878059 hartree
chargesum: -0.0000000
charge: -0.300094 -0.297108 -0.286945 -0.303595 -0.304018 -0.303221 -0.304156 -0.429902 -0.398320 -0.393533 -0.394302 -0.394138 0.025423 0.194289 0.203363 -0.186344 -0.185863 -0.114471 0.440443 0.354186 0.353681 0.411989 0.425415 0.426339 0.407609 -0.326541 -0.327395 -0.109879 -0.113277 -0.114346 -0.108697 0.154253 0.154198 0.167531 0.144559 0.144309 0.260366 0.106977 0.134485 0.113952 0.132058 0.113432 0.113388 0.113539 0.113761 0.132852 0.113500 0.105622 0.134627
qa: -0.3001 -0.2971 -0.2869 -0.3036 -0.3040 -0.3032 -0.3042 -0.4299 -0.3983 -0.3935 -0.3943 -0.3941 0.0254 0.1943 0.2034 -0.1863 -0.1859 -0.1145 0.4404 0.3542 0.3537 0.4120 0.4254 0.4263 0.4076 -0.3265 -0.3274 -0.1099 -0.1133 -0.1143 -0.1087 0.1543 0.1542 0.1675 0.1446 0.1443 0.2604 0.1070 0.1345 0.1140 0.1321 0.1134 0.1134 0.1135 0.1138 0.1329 0.1135 0.1056 0.1346
va: 2.0929 2.0920 2.2148 2.1161 2.1139 2.1156 2.1144 2.0396 2.9144 2.9509 2.9503 2.9193 3.5433 3.8389 3.7820 3.9859 3.9847 3.9054 4.0980 4.3170 4.3151 4.0215 3.9957 3.9944 4.0227 3.9335 3.9313 3.8386 3.8433 3.8429 3.8426 1.0006 1.0007 0.9846 1.0164 1.0163 0.9914 1.0009 0.9941 0.9966 0.9930 0.9969 0.9965 0.9968 0.9963 0.9931 0.9967 0.9988 0.9938
dispcorr: -0.025694950 hartree
energy: -1555.873826272296
dipole: 0.52652 -0.02842 0.49810 -2.05035 2.18567 0.13532 0.12195 -1.00900 -0.88705
magnitude: 1.02630 au
magnitude: 2.60864 debye
