program: Orca
programVersion: 4.2.1
elementType: O O O O O O O O N N N N C C C C C C C C C C C C C C C C C C C H H H H H H H H H H H H H H H H H H
charge: 0
multiplicity: 1
keywords: wb97x-d3
keywords: def2-TZVPP
keywords: def2/J RIJCOSX GRIDX6 NOFINALGRIDX
keywords: grid4 nofinalgrid
keywords: scfconv7
keywords: smallprint printgap noloewdin
keywords: NOSOSCF
formula: C19H18N4O8
InChI: InChI=1/C19H18N4O8/c1-26-12-8-13(27-2)21-18(20-12)30-10-6-5-7-11(16(10)17(24)25)31-19-22-14(28-3)9-15(23-19)29-4/h5-9,24H,1-4H3
49 atoms
O  2.048938 1.635642 1.061194
O  -2.522312 1.808388 -0.411772
O  0.205993 -0.315306 1.575609
O  4.92243 -1.619445 2.312068
O  -1.603474 -2.600538 -1.18283
O  3.309333 -1.46639 -2.041403
O  -5.850721 -1.19989 0.064356
O  -1.599112 0.87427 2.119838
N  3.486718 0.051691 1.689309
N  -2.024575 -0.376281 -0.849358
N  2.677506 0.126874 -0.528163
N  -4.175558 0.339588 -0.186176
C  -0.226695 1.636025 0.34435
C  1.082055 2.081667 0.185734
C  -1.19645 2.151911 -0.519488
C  1.421177 3.024758 -0.766657
C  -0.871373 3.073308 -1.4952
C  0.437464 3.519437 -1.603739
C  -0.618301 0.703179 1.435366
C  2.762974 0.546866 0.709891
C  -2.908969 0.520007 -0.485121
C  4.172466 -1.042445 1.385104
C  -2.449559 -1.634733 -0.860085
C  3.365905 -0.970694 -0.812993
C  -4.589217 -0.92122 -0.222668
C  4.143841 -1.629563 0.125845
C  -3.753458 -1.983165 -0.545398
C  4.962894 -1.054039 3.6195
C  -0.270532 -2.249902 -1.552138
C  2.655509 -0.707552 -3.056477
C  -6.73212 -0.136801 0.417966
H  2.444183 3.365368 -0.848069
H  -1.640571 3.447101 -2.157183
H  0.690958 4.252116 -2.357064
H  4.701115 -2.524855 -0.107159
H  -4.098105 -3.006612 -0.553704
H  -0.07122 -0.872892 2.320332
H  5.622106 -1.697215 4.19592
H  5.368579 -0.042869 3.610805
H  3.978086 -1.042881 4.085463
H  0.227334 -1.680863 -0.768949
H  0.249089 -3.191698 -1.705869
H  -0.259545 -1.679448 -2.480512
H  1.634715 -0.444268 -2.786565
H  3.205108 0.20766 -3.27822
H  2.645661 -1.341779 -3.938477
H  -6.399645 0.38055 1.317211
H  -6.842882 0.583009 -0.392249
H  -7.692631 -0.60608 0.61147
elementType: O N C H
totalener: -1555.84663611 hartree
nucrepener: 3250.57575337 hartree
electener: -4806.42238948 hartree
oneelecener: -8592.19771551 hartree
twoeener: 3785.77532603 hartree
cpcmener: -0.04676295 hartree
kineticenergy: 1549.69427749 hartree
xcener: -143.545768548987 hartree
chargesum: -0.0000000
charge: -0.319481 -0.296126 -0.264218 -0.305755 -0.307299 -0.307716 -0.303504 -0.431611 -0.388047 -0.388304 -0.361145 -0.393139 -0.011858 0.272665 0.211168 -0.200789 -0.199253 -0.112477 0.418245 0.354853 0.352527 0.425993 0.408544 0.375104 0.428764 -0.328974 -0.333598 -0.114570 -0.103316 -0.115038 -0.114079 0.148340 0.154762 0.167281 0.144685 0.144842 0.257893 0.132560 0.112631 0.112763 0.094510 0.142121 0.118976 0.096516 0.125290 0.139621 0.113360 0.113287 0.132995
qa: -0.3195 -0.2961 -0.2642 -0.3058 -0.3073 -0.3077 -0.3035 -0.4316 -0.3880 -0.3883 -0.3611 -0.3931 -0.0119 0.2727 0.2112 -0.2008 -0.1993 -0.1125 0.4182 0.3549 0.3525 0.4260 0.4085 0.3751 0.4288 -0.3290 -0.3336 -0.1146 -0.1033 -0.1150 -0.1141 0.1483 0.1548 0.1673 0.1447 0.1448 0.2579 0.1326 0.1126 0.1128 0.0945 0.1421 0.1190 0.0965 0.1253 0.1396 0.1134 0.1133 0.1330
va: 2.0809 2.0991 2.2079 2.1111 2.1199 2.0895 2.1152 2.0585 2.9427 2.9239 2.8995 2.9534 3.6531 3.8012 3.8144 3.9824 3.9900 3.8905 4.2147 4.3014 4.3139 3.9963 4.0167 4.0347 3.9947 3.9494 3.9405 3.8462 3.8436 3.8360 3.8439 1.0009 1.0007 0.9844 1.0163 1.0166 0.9931 0.9931 0.9964 0.9970 0.9977 0.9934 0.9918 0.9963 0.9971 0.9912 0.9969 0.9963 0.9928
dispcorr: -0.027513190 hartree
energy: -1555.874149301218
dipole: 3.41316 -2.15662 1.25654 -5.93281 5.30659 -0.62622 -5.17496 3.81342 -1.36154
magnitude: 1.95572 au
magnitude: 4.97105 debye
