program: Orca
programVersion: 4.2.1
elementType: O O O O O O O O N N N N C C C C C C C C C C C C C C C C C C C H H H H H H H H H H H H H H H H H H
charge: 0
multiplicity: 1
keywords: wb97x-d3
keywords: def2-TZVPP
keywords: def2/J RIJCOSX GRIDX6 NOFINALGRIDX
keywords: grid4 nofinalgrid
keywords: scfconv7
keywords: smallprint printgap noloewdin
keywords: NOSOSCF
formula: C19H18N4O8
InChI: InChI=1/C19H18N4O8/c1-26-12-8-13(27-2)21-18(20-12)30-10-6-5-7-11(16(10)17(24)25)31-19-22-14(28-3)9-15(23-19)29-4/h5-9,24H,1-4H3
49 atoms
O  2.236862 0.684071 -1.344592
O  -2.244151 1.481534 0.317254
O  -0.574453 -0.426877 1.322781
O  5.621992 -1.910851 0.125667
O  -5.680634 -1.266459 1.313044
O  3.180381 0.661924 3.122874
O  -3.077268 -2.052637 -2.450995
O  0.561152 -1.323615 -0.372769
N  3.909934 -0.595776 -0.635904
N  -3.944891 0.140742 0.817367
N  2.68171 0.721792 0.892563
N  -2.635084 -0.256527 -1.107759
C  0.003619 0.986296 -0.454016
C  1.118186 1.458142 -1.152697
C  -1.114045 1.821854 -0.387456
C  1.13172 2.710643 -1.7372
C  -1.123708 3.067443 -0.988038
C  0.004797 3.511015 -1.655941
C  0.029859 -0.372617 0.14809
C  2.963903 0.251037 -0.29783
C  -2.963582 0.394635 -0.019045
C  4.649594 -1.04663 0.369937
C  -4.673261 -0.929456 0.523666
C  3.423845 0.250748 1.888628
C  -3.366347 -1.332274 -1.379275
C  4.45005 -0.659213 1.689064
C  -4.427147 -1.732845 -0.582914
C  5.839222 -2.350131 -1.21297
C  -5.955315 -0.471509 2.464103
C  2.109097 1.579258 3.338912
C  -1.973802 -1.655598 -3.263982
H  2.017732 3.049407 -2.256482
H  -2.010505 3.683211 -0.926415
H  0.005066 4.487706 -2.118901
H  5.050641 -1.042265 2.500965
H  -5.021814 -2.606601 -0.805438
H  -0.544252 -1.333226 1.669021
H  6.113048 -1.525507 -1.870479
H  6.666827 -3.051983 -1.158829
H  4.964847 -2.858991 -1.61732
H  -6.224389 0.549494 2.195197
H  -6.802306 -0.946243 2.95147
H  -5.111283 -0.452413 3.152574
H  2.290558 2.533567 2.845563
H  1.157467 1.174088 2.99628
H  2.068146 1.73324 4.413635
H  -1.897897 -2.40914 -4.042869
H  -2.142763 -0.68192 -3.722693
H  -1.044087 -1.628913 -2.696785
elementType: O N C H
totalener: -1555.84825945 hartree
nucrepener: 3208.53650913 hartree
electener: -4764.38476858 hartree
oneelecener: -8508.90439621 hartree
twoeener: 3744.51962763 hartree
cpcmener: -0.04572800 hartree
kineticenergy: 1549.68153312 hartree
xcener: -143.544438755527 hartree
chargesum: 0.0000000
charge: -0.296996 -0.299427 -0.288612 -0.304036 -0.303504 -0.304589 -0.303920 -0.432189 -0.395121 -0.394556 -0.396782 -0.396716 0.023018 0.205853 0.193765 -0.185849 -0.182680 -0.115744 0.441334 0.356651 0.354379 0.425146 0.426359 0.408643 0.411263 -0.327106 -0.327007 -0.114805 -0.112765 -0.108413 -0.108611 0.154808 0.154023 0.167582 0.144907 0.144554 0.260696 0.113561 0.132717 0.113887 0.113285 0.132041 0.113213 0.113391 0.105867 0.134620 0.134498 0.112684 0.106684
qa: -0.2970 -0.2994 -0.2886 -0.3040 -0.3035 -0.3046 -0.3039 -0.4322 -0.3951 -0.3946 -0.3968 -0.3967 0.0230 0.2059 0.1938 -0.1858 -0.1827 -0.1157 0.4413 0.3567 0.3544 0.4251 0.4264 0.4086 0.4113 -0.3271 -0.3270 -0.1148 -0.1128 -0.1084 -0.1086 0.1548 0.1540 0.1676 0.1449 0.1446 0.2607 0.1136 0.1327 0.1139 0.1133 0.1320 0.1132 0.1134 0.1059 0.1346 0.1345 0.1127 0.1067
va: 2.0924 2.0924 2.2123 2.1140 2.1150 2.1150 2.1155 2.0374 2.9535 2.9507 2.9186 2.9148 3.5443 3.7823 3.8397 3.9859 3.9827 3.9064 4.0962 4.3121 4.3150 3.9979 3.9938 4.0226 4.0217 3.9313 3.9319 3.8433 3.8435 3.8420 3.8394 1.0005 1.0006 0.9846 1.0162 1.0163 0.9910 0.9962 0.9929 0.9967 0.9964 0.9931 0.9968 0.9971 0.9990 0.9938 0.9941 0.9971 1.0007
dispcorr: -0.025644142 hartree
energy: -1555.873903590465
dipole: -0.49904 0.00017 -0.49887 -1.23438 2.03196 0.79758 1.40393 -0.93906 0.46487
magnitude: 1.04934 au
magnitude: 2.66722 debye
