program: Orca
programVersion: 4.2.1
elementType: O O O O O O O O N N N N C C C C C C C C C C C C C C C C C C C H H H H H H H H H H H H H H H H H H
charge: 0
multiplicity: 1
keywords: wb97x-d3
keywords: def2-TZVPP
keywords: def2/J RIJCOSX GRIDX6 NOFINALGRIDX
keywords: grid4 nofinalgrid
keywords: scfconv7
keywords: smallprint printgap noloewdin
keywords: NOSOSCF
formula: C19H18N4O8
InChI: InChI=1/C19H18N4O8/c1-26-12-8-13(27-2)21-18(20-12)30-10-6-5-7-11(16(10)17(24)25)31-19-22-14(28-3)9-15(23-19)29-4/h5-9,24H,1-4H3
49 atoms
O  1.995606 1.815517 0.058648
O  -1.600333 -1.15135 -1.10274
O  0.307482 0.638263 1.860235
O  4.076502 -2.229193 0.392763
O  -5.721755 -2.700431 -0.150111
O  5.700567 1.515785 2.607664
O  -4.977626 1.865977 -0.574568
O  -0.044861 -1.446141 1.154457
N  3.001222 -0.224966 0.196671
N  -3.628346 -1.926955 -0.632809
N  3.81632 1.680031 1.32688
N  -3.251241 0.395713 -0.831549
C  0.160808 0.311951 -0.444831
C  1.078275 1.298519 -0.820142
C  -0.734966 -0.134717 -1.413002
C  1.081406 1.830009 -2.09468
C  -0.751058 0.394626 -2.691849
C  0.157014 1.381563 -3.025718
C  0.136305 -0.279384 0.921213
C  2.977658 1.038042 0.545356
C  -2.886402 -0.863182 -0.845719
C  3.995688 -0.947444 0.700076
C  -4.907521 -1.685217 -0.380683
C  4.808072 0.947071 1.816532
C  -4.53725 0.61981 -0.588835
C  4.95941 -0.406151 1.537217
C  -5.443036 -0.402778 -0.349343
C  3.084526 -2.791023 -0.464708
C  -5.191425 -4.021952 -0.166298
C  5.569422 2.901671 2.908275
C  -4.050111 2.917728 -0.830474
H  1.808483 2.58722 -2.356168
H  -1.46528 0.032757 -3.419166
H  0.155333 1.799837 -4.022902
H  5.770437 -0.99255 1.943731
H  -6.488496 -0.217473 -0.15041
H  0.316979 0.21814 2.734739
H  3.352622 -3.838764 -0.574501
H  2.08738 -2.716737 -0.03161
H  3.083442 -2.315996 -1.445995
H  -6.02957 -4.676875 0.05751
H  -4.783623 -4.283205 -1.142972
H  -4.419126 -4.157785 0.591055
H  4.636792 3.116722 3.430429
H  6.406515 3.140056 3.559701
H  5.627841 3.518287 2.010973
H  -3.252637 2.943601 -0.087925
H  -3.60775 2.833576 -1.823317
H  -4.626459 3.837525 -0.771225
elementType: O N C H
totalener: -1555.84873058 hartree
nucrepener: 3139.52047330 hartree
electener: -4695.36920388 hartree
oneelecener: -8370.54743926 hartree
twoeener: 3675.17823538 hartree
cpcmener: -0.03903278 hartree
kineticenergy: 1549.74033894 hartree
xcener: -143.549646946386 hartree
chargesum: 0.0000000
charge: -0.292709 -0.290305 -0.276198 -0.295022 -0.296790 -0.295206 -0.297742 -0.405140 -0.398398 -0.396470 -0.394229 -0.395379 0.026042 0.188796 0.243245 -0.185958 -0.163427 -0.125599 0.369614 0.368465 0.371266 0.400887 0.417700 0.419658 0.385354 -0.327373 -0.323224 -0.113195 -0.113593 -0.113562 -0.107115 0.151517 0.147955 0.164122 0.143054 0.141939 0.251339 0.133034 0.112065 0.110071 0.129730 0.111593 0.112871 0.111964 0.130021 0.112592 0.111050 0.109661 0.131027
qa: -0.2927 -0.2903 -0.2762 -0.2950 -0.2968 -0.2952 -0.2977 -0.4051 -0.3984 -0.3965 -0.3942 -0.3954 0.0260 0.1888 0.2432 -0.1860 -0.1634 -0.1256 0.3696 0.3685 0.3713 0.4009 0.4177 0.4197 0.3854 -0.3274 -0.3232 -0.1132 -0.1136 -0.1136 -0.1071 0.1515 0.1480 0.1641 0.1431 0.1419 0.2513 0.1330 0.1121 0.1101 0.1297 0.1116 0.1129 0.1120 0.1300 0.1126 0.1110 0.1097 0.1310
va: 2.1010 2.1103 2.2192 2.1262 2.1220 2.1239 2.1216 2.0663 2.9122 2.9593 2.9565 2.9170 3.5894 3.8692 3.7749 4.0016 3.9894 3.9106 4.2508 4.2882 4.2782 4.0450 4.0041 4.0040 4.0617 3.9237 3.9159 3.8400 3.8483 3.8474 3.8505 1.0002 0.9988 0.9858 1.0168 1.0169 0.9993 0.9942 1.0015 0.9972 0.9932 0.9971 0.9967 0.9970 0.9932 0.9969 0.9964 0.9945 0.9935
dispcorr: -0.024233328 hartree
energy: -1555.872963905734
dipole: -0.85010 0.92827 0.07818 0.82934 0.20780 1.03714 -1.30047 0.72053 -0.57994
magnitude: 1.19084 au
magnitude: 3.02688 debye
