program: Orca
programVersion: 4.2.1
elementType: O O O O O O O O N N N N C C C C C C C C C C C C C C C C C C C H H H H H H H H H H H H H H H H H H
charge: 0
multiplicity: 1
keywords: wb97x-d3
keywords: def2-TZVPP
keywords: def2/J RIJCOSX GRIDX6 NOFINALGRIDX
keywords: grid4 nofinalgrid
keywords: scfconv7
keywords: smallprint printgap noloewdin
keywords: NOSOSCF
formula: C19H18N4O8
InChI: InChI=1/C19H18N4O8/c1-26-12-8-13(27-2)21-18(20-12)30-10-6-5-7-11(16(10)17(24)25)31-19-22-14(28-3)9-15(23-19)29-4/h5-9,24H,1-4H3
49 atoms
O  1.948569 -0.68842 0.760857
O  -2.343295 1.344488 0.159578
O  0.055807 -1.60756 -0.947713
O  6.115302 -1.385101 -0.801233
O  -6.121921 0.097298 -1.958912
O  4.660145 2.927197 0.131048
O  -3.652766 -3.013558 0.449041
O  -0.710568 0.258483 -1.897114
N  4.002761 -1.041792 -0.003609
N  -4.208196 0.743424 -0.891903
N  3.260214 1.15291 0.447291
N  -2.959939 -0.841699 0.333439
C  -0.187366 0.284008 0.41614
C  0.939473 0.120012 1.215543
C  -1.224396 1.08159 0.907786
C  1.040671 0.719801 2.460084
C  -1.144856 1.676613 2.150376
C  -0.005939 1.495107 2.921798
C  -0.307781 -0.339216 -0.930387
C  3.121791 -0.14872 0.389083
C  -3.202084 0.355961 -0.141322
C  5.176013 -0.554071 -0.382747
C  -5.077953 -0.206934 -1.207634
C  4.445534 1.623962 0.078534
C  -3.837858 -1.782617 0.005622
C  5.473486 0.803569 -0.361294
C  -4.948784 -1.524182 -0.782525
C  5.824883 -2.778583 -0.852511
C  -6.274973 1.439065 -2.411509
C  3.615268 3.769982 0.608521
C  -2.520643 -3.278014 1.273815
H  1.928186 0.575836 3.061078
H  -1.968659 2.277955 2.511001
H  0.061053 1.96182 3.894982
H  6.43527 1.19062 -0.664961
H  -5.663254 -2.289987 -1.047133
H  -0.031883 -1.964153 -1.84588
H  5.596698 -3.182211 0.134179
H  4.996446 -2.994537 -1.527473
H  6.726897 -3.252067 -1.231934
H  -5.440039 1.752554 -3.038451
H  -7.187587 1.446527 -3.002057
H  -6.380581 2.137058 -1.580836
H  3.32911 3.520041 1.630443
H  4.018802 4.77908 0.585711
H  2.732168 3.721428 -0.028618
H  -2.576874 -4.335206 1.51879
H  -1.58522 -3.077803 0.752891
H  -2.546766 -2.694751 2.193939
elementType: O N C H
totalener: -1555.84862560 hartree
nucrepener: 3130.18607934 hartree
electener: -4686.03470494 hartree
oneelecener: -8351.77239944 hartree
twoeener: 3665.73769450 hartree
cpcmener: -0.03991747 hartree
kineticenergy: 1549.73986420 hartree
xcener: -143.549828373237 hartree
chargesum: -0.0000000
charge: -0.294622 -0.289376 -0.272308 -0.296461 -0.295666 -0.297141 -0.295829 -0.405283 -0.397990 -0.393030 -0.397450 -0.397652 0.005645 0.232601 0.208358 -0.170911 -0.192981 -0.119574 0.388158 0.376635 0.364038 0.416675 0.421391 0.388188 0.398186 -0.323134 -0.326085 -0.113513 -0.114600 -0.107851 -0.111659 0.142553 0.151933 0.164107 0.142807 0.142330 0.255249 0.112304 0.111665 0.129705 0.113650 0.130101 0.111690 0.109252 0.131678 0.112204 0.133132 0.107697 0.111184
qa: -0.2946 -0.2894 -0.2723 -0.2965 -0.2957 -0.2971 -0.2958 -0.4053 -0.3980 -0.3930 -0.3974 -0.3977 0.0056 0.2326 0.2084 -0.1709 -0.1930 -0.1196 0.3882 0.3766 0.3640 0.4167 0.4214 0.3882 0.3982 -0.3231 -0.3261 -0.1135 -0.1146 -0.1079 -0.1117 0.1426 0.1519 0.1641 0.1428 0.1423 0.2552 0.1123 0.1117 0.1297 0.1136 0.1301 0.1117 0.1093 0.1317 0.1122 0.1331 0.1077 0.1112
va: 2.1049 2.1071 2.2079 2.1215 2.1235 2.1223 2.1241 2.0884 2.9571 2.9558 2.9338 2.9101 3.6495 3.8364 3.8144 3.9707 4.0092 3.9011 4.2708 4.2847 4.2931 4.0053 4.0040 4.0612 4.0432 3.9173 3.9237 3.8485 3.8481 3.8472 3.8443 1.0030 1.0002 0.9858 1.0166 1.0171 0.9970 0.9966 0.9971 0.9935 0.9968 0.9930 0.9969 0.9941 0.9936 0.9968 0.9939 0.9992 0.9976
dispcorr: -0.024096645 hartree
energy: -1555.872722246431
dipole: 1.74349 -1.21314 0.53035 -0.42371 0.02838 -0.39533 2.13464 -0.90049 1.23415
magnitude: 1.40025 au
magnitude: 3.55914 debye
