program: Orca
programVersion: 4.2.1
elementType: O O O O O O O O N N N N C C C C C C C C C C C C C C C C C C C H H H H H H H H H H H H H H H H H H
charge: 0
multiplicity: 1
keywords: wb97x-d3
keywords: def2-TZVPP
keywords: def2/J RIJCOSX GRIDX6 NOFINALGRIDX
keywords: grid4 nofinalgrid
keywords: scfconv7
keywords: smallprint printgap noloewdin
keywords: NOSOSCF
formula: C19H18N4O8
InChI: InChI=1/C19H18N4O8/c1-26-12-8-13(27-2)21-18(20-12)30-10-6-5-7-11(16(10)17(24)25)31-19-22-14(28-3)9-15(23-19)29-4/h5-9,24H,1-4H3
49 atoms
O  2.576416 1.653079 -0.621925
O  -1.918794 0.564065 -1.877993
O  -0.138794 -1.285362 -0.96807
O  5.972533 -0.861897 0.932524
O  -3.686977 0.074263 2.294104
O  1.689731 -1.387175 2.660583
O  -5.103026 -2.565363 -1.262195
O  1.700894 -0.687947 -2.073633
N  4.261686 0.422951 0.145268
N  -2.772537 0.348786 0.22281
N  2.089535 0.154513 1.025078
N  -3.493063 -0.982889 -1.586495
C  0.306415 1.014241 -1.174186
C  1.255709 1.957536 -0.770435
C  -0.999703 1.448584 -1.375608
C  0.899556 3.27638 -0.557733
C  -1.364397 2.770029 -1.185924
C  -0.407969 3.679652 -0.776339
C  0.71428 -0.387926 -1.462846
C  2.979514 0.691792 0.221937
C  -2.758149 -0.047058 -1.02962
C  4.69306 -0.528764 0.958349
C  -3.621509 -0.283704 1.020442
C  2.537591 -0.798089 1.832735
C  -4.332064 -1.607004 -0.774419
C  3.863083 -1.20274 1.847839
C  -4.447648 -1.305213 0.578215
C  6.820779 -0.189229 0.014789
C  -2.907285 1.181381 2.715632
C  0.349764 -0.920502 2.693054
C  -4.992925 -2.877778 -2.641593
H  1.654898 3.981729 -0.239679
H  -2.38462 3.076035 -1.371121
H  -0.680727 4.715207 -0.624999
H  4.22568 -1.979063 2.503676
H  -5.137523 -1.818432 1.230047
H  0.163359 -2.164802 -1.233176
H  6.497977 -0.334908 -1.016115
H  6.863906 0.881827 0.213747
H  7.806547 -0.625437 0.154491
H  -3.195823 2.097871 2.200182
H  -3.099652 1.288296 3.780054
H  -1.842632 1.021744 2.548116
H  -0.136117 -0.989675 1.720497
H  -0.166086 -1.557322 3.407157
H  0.299297 0.115776 3.031021
H  -5.704607 -3.68015 -2.817744
H  -5.241485 -2.024146 -3.272178
H  -3.989892 -3.215817 -2.902192
totalener: -1555.82693963 hartree
nucrepener: 3228.79580049 hartree
electener: -4784.62274012 hartree
oneelecener: -8547.25934323 hartree
twoeener: 3762.63660311 hartree
kineticenergy: 1549.80984638 hartree
xcener: -143.558144044110 hartree
chargesum: -0.0000000
charge: -0.255928 -0.275710 -0.266657 -0.268931 -0.270515 -0.271337 -0.268357 -0.309376 -0.346534 -0.371298 -0.388393 -0.343809 -0.022808 0.217083 0.253328 -0.175838 -0.176542 -0.093979 0.353513 0.342491 0.333932 0.399871 0.357778 0.374645 0.390206 -0.307650 -0.302671 -0.121626 -0.111541 -0.109754 -0.119562 0.129147 0.118921 0.130600 0.123558 0.125693 0.202213 0.114422 0.106714 0.118237 0.109233 0.125410 0.088340 0.098311 0.125767 0.103559 0.120259 0.109157 0.106431
qa: -0.2559 -0.2757 -0.2667 -0.2689 -0.2705 -0.2713 -0.2684 -0.3094 -0.3465 -0.3713 -0.3884 -0.3438 -0.0228 0.2171 0.2533 -0.1758 -0.1765 -0.0940 0.3535 0.3425 0.3339 0.3999 0.3578 0.3746 0.3902 -0.3076 -0.3027 -0.1216 -0.1115 -0.1098 -0.1196 0.1291 0.1189 0.1306 0.1236 0.1257 0.2022 0.1144 0.1067 0.1182 0.1092 0.1254 0.0883 0.0983 0.1258 0.1036 0.1203 0.1092 0.1064
va: 2.1583 2.1323 2.1756 2.1412 2.1307 2.1453 2.1383 2.1846 2.9749 2.9118 2.9279 2.9630 3.6705 3.8852 3.8769 4.0250 4.0217 3.9353 4.2351 4.3218 4.3120 4.0210 4.0766 4.0554 4.0273 3.9322 3.9285 3.8725 3.8735 3.8750 3.8733 1.0102 1.0105 0.9971 1.0230 1.0226 1.0422 0.9980 0.9989 0.9921 1.0005 0.9926 0.9991 0.9996 0.9928 0.9962 0.9920 0.9989 0.9993
dispcorr: -0.026637424 hartree
energy: -1555.853577051574
dipole: -3.70491 2.96347 -0.74144 -1.06758 1.32396 0.25638 7.17706 -6.43191 0.74515
magnitude: 1.08200 au
magnitude: 2.75022 debye
