program: Orca
programVersion: 4.2.1
elementType: O O O O O O O O N N N N C C C C C C C C C C C C C C C C C C C H H H H H H H H H H H H H H H H H H
charge: 0
multiplicity: 1
keywords: wb97x-d3
keywords: def2-TZVPP
keywords: def2/J RIJCOSX GRIDX6 NOFINALGRIDX
keywords: grid4 nofinalgrid
keywords: scfconv7
keywords: smallprint printgap noloewdin
keywords: NOSOSCF
formula: C19H18N4O8
InChI: InChI=1/C19H18N4O8/c1-26-12-8-13(27-2)21-18(20-12)30-10-6-5-7-11(16(10)17(24)25)31-19-22-14(28-3)9-15(23-19)29-4/h5-9,24H,1-4H3
49 atoms
O  2.232649 0.685133 -1.295721
O  -2.256569 1.396204 0.365435
O  0.572137 -1.341924 -0.500544
O  3.009267 0.518921 3.192713
O  -5.737128 -1.333606 1.21606
O  5.840977 -1.583239 0.164171
O  -3.080274 -2.019318 -2.538486
O  -0.544052 -0.637379 1.291393
N  2.585066 0.628412 0.954032
N  -3.981673 0.057805 0.792095
N  4.017241 -0.438252 -0.587035
N  -2.632642 -0.29909 -1.109279
C  -0.017094 0.930081 -0.422924
C  1.097552 1.423223 -1.104104
C  -1.138073 1.758471 -0.327836
C  1.095381 2.687377 -1.668179
C  -1.15327 3.018813 -0.898561
C  -0.032928 3.480529 -1.565815
C  -0.034435 -0.405762 0.229682
C  2.967762 0.276727 -0.251257
C  -2.977778 0.329336 -0.008479
C  3.343891 0.201325 1.956463
C  -4.714283 -0.990878 0.449849
C  4.766803 -0.854527 0.423104
C  -3.379372 -1.344081 -1.441037
C  4.481589 -0.566621 1.752662
C  -4.464024 -1.757591 -0.68301
C  1.827543 1.285227 3.3961
C  -5.978582 -0.571314 2.388343
C  6.134296 -1.885801 -1.190328
C  -1.973698 -1.580121 -3.314058
H  1.980168 3.036528 -2.182468
H  -2.043406 3.626421 -0.811157
H  -0.038996 4.467018 -2.008959
H  5.098615 -0.915334 2.566562
H  -5.068362 -2.610651 -0.950756
H  0.542848 -2.169946 -0.002218
H  0.940774 0.765488 3.034804
H  1.755678 1.427238 4.471186
H  1.887726 2.255963 2.903458
H  -6.838963 -1.03353 2.865748
H  -5.126467 -0.593467 3.068124
H  -6.205315 0.469523 2.155754
H  5.333639 -2.456908 -1.661077
H  6.304803 -0.984653 -1.779803
H  7.042363 -2.482887 -1.166909
H  -2.11556 -0.563075 -3.681053
H  -1.04174 -1.61472 -2.749836
H  -1.917396 -2.265297 -4.156157
totalener: -1555.82872566 hartree
nucrepener: 3213.10815577 hartree
electener: -4768.93688143 hartree
oneelecener: -8516.23760011 hartree
twoeener: 3747.30071868 hartree
kineticenergy: 1549.79775540 hartree
xcener: -143.558389077721 hartree
chargesum: 0.0000000
charge: -0.262960 -0.257782 -0.269834 -0.265868 -0.269196 -0.267960 -0.268440 -0.335328 -0.391725 -0.348842 -0.347708 -0.394475 0.022304 0.190753 0.202382 -0.165409 -0.164231 -0.099057 0.374984 0.331995 0.348218 0.381974 0.396828 0.389302 0.373474 -0.305535 -0.304146 -0.126435 -0.121349 -0.120090 -0.117341 0.128980 0.128643 0.131014 0.125348 0.123038 0.201719 0.124736 0.120473 0.103999 0.117959 0.112663 0.106808 0.107413 0.108084 0.119821 0.106280 0.102601 0.121921
qa: -0.2630 -0.2578 -0.2698 -0.2659 -0.2692 -0.2680 -0.2684 -0.3353 -0.3917 -0.3488 -0.3477 -0.3945 0.0223 0.1908 0.2024 -0.1654 -0.1642 -0.0991 0.3750 0.3320 0.3482 0.3820 0.3968 0.3893 0.3735 -0.3055 -0.3041 -0.1264 -0.1213 -0.1201 -0.1173 0.1290 0.1286 0.1310 0.1253 0.1230 0.2017 0.1247 0.1205 0.1040 0.1180 0.1127 0.1068 0.1074 0.1081 0.1198 0.1063 0.1026 0.1219
va: 2.1414 2.1503 2.1966 2.1491 2.1394 2.1379 2.1409 2.1321 2.9165 2.9757 2.9690 2.9194 3.5411 3.9007 3.8493 4.0233 4.0213 3.9489 4.1011 4.3265 4.3121 4.0672 4.0224 4.0197 4.0690 3.9218 3.9248 3.8585 3.8734 3.8730 3.8716 1.0093 1.0096 0.9974 1.0227 1.0231 1.0418 0.9996 0.9943 0.9971 0.9922 0.9983 0.9988 0.9989 0.9990 0.9923 0.9984 1.0000 0.9936
dispcorr: -0.025816540 hartree
energy: -1555.854542201088
dipole: 0.49492 -0.23060 0.26432 -1.36202 1.54676 0.18475 -0.19179 -0.32063 -0.51242
magnitude: 0.60545 au
magnitude: 1.53892 debye
