program: Gaussian 09
title: 000068856
version: EM64L-G09RevD.01
frameworkgroup: C1[X(C20H17ClFN3O4)]
method: RPBEPBE
basis: SDD
operation: Freq
keyword: #p
keyword: freq=noraman
keyword: PBEPBE/SDD
title: #p freq=noraman PBEPBE/SDD
converged: YES YES NO NO
title: Mulliken charges:
elementType: Cl F O O O O N N N C C C C C C C C C C C C C C C C C C C C H H H H H H H H H H H H H H H H H
charge: -0.037856 -0.170744 -0.272438 -0.250752 -0.182408 -0.265789 -0.350092 0.014441 -0.391477 0.219469 0.297454 -0.428678 -0.022894 0.217230 0.169814 -0.314616 -0.298897 0.223442 0.279885 -0.134574 -0.229633 0.178359 -0.323861 -0.369450 -0.243370 -0.198622 -0.214335 -0.608812 -0.674884 0.300305 0.289676 0.272138 0.264525 0.266018 0.376957 0.259072 0.237569 0.238801 0.229850 0.235193 0.236770 0.233445 0.271080 0.230993 0.228771 0.212925
chargesum: 0.00000
title: Mulliken charges with hydrogens summed into heavy atoms:
elementType: Cl F O O O O N N N C C C C C C C C C C C C C C C C C C C C
charge: -0.037856 -0.170744 -0.272438 -0.250752 -0.182408 -0.265789 -0.350092 0.014441 -0.014521 0.219469 0.297454 -0.128372 -0.022894 0.217230 0.169814 -0.024939 -0.026758 0.223442 0.279885 -0.134574 0.034891 0.178359 -0.057844 -0.110378 -0.005801 0.040179 0.250707 0.132483 -0.002195
chargesum: 0.00652
polarizability: 3.20113079e+02 -7.00816319e+00 2.70541862e+02 1.33533711e+01 1.42546347e+01 2.19703949e+02
1716.lowfreq: -31.7795 -25.9585 -4.1981 -0.0045 -0.0029 3.1762 17.5963 22.4968 26.8984
frequency: 4.8151 20.0212 24.6792 36.7306 47.1657 52.0969 57.0489 64.8155 70.4000 72.2893 78.8916 120.6318 125.3496 141.2413 152.5207 161.8204 173.0307 182.6774 222.1283 229.6997 237.1538 251.5023 253.4095 262.1063 297.6622 312.0158 325.1937 355.3744 364.4570 375.2847 407.0057 418.2320 429.1943 444.9198 449.4181 477.9854 488.5798 511.4497 527.6466 540.5051 572.7510 588.3911 630.4270 654.3311 666.8885 685.1551 703.5915 717.0685 725.1448 752.6045 758.1542 771.0937 778.1590 796.4874 799.7361 811.4684 822.5983 833.6891 842.6129 867.2092 873.0247 889.9770 928.4618 946.7616 949.8478 953.4080 974.5505 988.1588 1000.5323 1031.0347 1038.5249 1058.1495 1086.7579 1095.3888 1104.8739 1116.2369 1122.7410 1130.3663 1136.1440 1142.7645 1165.3947 1171.9283 1176.5623 1198.9286 1206.9796 1230.6293 1248.2924 1250.2099 1266.5994 1277.5745 1286.8798 1317.8451 1358.7716 1376.3429 1378.7353 1383.9849 1400.7287 1423.3210 1432.0482 1462.2302 1463.5167 1470.0735 1473.9693 1481.7026 1486.0077 1486.1195 1526.5678 1548.2596 1572.5816 1583.9002 1590.9879 1602.7181 1614.2982 1679.1275 1683.5835 2956.1174 2986.7689 2995.8109 3012.2232 3066.8762 3071.3345 3092.3789 3107.8610 3121.5655 3139.3473 3149.9128 3167.1897 3168.4045 3169.2296 3180.9807 3188.1055 3308.0539
redmass: 6.0248 4.4451 5.9587 6.2368 5.3998 5.1058 2.8243 1.1067 7.8355 5.2971 4.6115 4.7574 10.3813 4.7546 4.0453 4.5833 5.0925 5.0422 3.8772 6.1130 6.1096 2.8230 4.2451 2.6915 6.9886 7.7704 5.9444 4.2703 7.5909 6.0480 6.0597 7.5164 6.0086 6.0879 4.2723 6.9026 5.3091 4.4917 5.0208 6.4663 8.0119 5.8101 7.1039 5.8352 6.2451 6.5935 7.2922 7.4211 5.8844 4.3237 3.6606 1.4335 5.5333 3.9847 1.1903 1.8693 3.2508 1.1435 4.1844 1.6194 4.0879 1.4813 6.2040 2.2213 1.8958 1.5902 5.8039 1.3371 3.5085 2.6759 2.3791 5.7801 2.0882 2.7230 2.8509 2.2576 1.2950 1.7879 1.4718 2.2014 1.8028 1.3645 1.4808 3.0098 1.7586 2.8762 2.0827 1.1370 1.6185 1.9935 2.2291 2.1544 1.4015 6.8312 10.9910 4.5119 1.2682 1.1708 2.3363 2.1343 1.0419 1.2457 1.0618 2.8101 1.0672 1.0442 2.0197 8.8806 8.1675 7.1119 4.6210 5.5049 7.2080 8.2172 11.2047 1.0802 1.0352 1.0358 1.0582 1.1022 1.1065 1.0985 1.1029 1.0990 1.0867 1.0907 1.0953 1.0894 1.0923 1.0994 1.0976 1.0828
irintensity: 1.1559 0.3283 0.2061 0.1856 1.3175 1.2800 1.6353 0.0356 0.4984 3.3089 0.1449 0.1941 1.7087 1.2458 5.3859 2.4953 1.8442 3.2155 2.2276 2.5208 1.8921 1.1234 1.6563 3.8832 1.6946 2.1264 14.6413 7.9729 28.7816 4.6231 2.2370 1.0249 6.4603 4.0957 2.7849 2.5830 16.7405 8.0056 2.2511 0.6745 29.9334 2.4602 18.2746 10.0625 3.1880 3.5595 11.0263 6.7299 0.3336 13.2469 6.5431 70.9525 42.3072 7.0260 8.9495 3.1368 25.4973 114.4534 1.5187 7.5305 17.7473 14.4165 41.7683 6.2293 3.2826 0.6883 4.4454 0.5148 32.6551 94.8657 106.2228 106.2128 28.3845 18.8159 294.3365 79.0077 0.0939 23.1844 2.1345 164.8295 21.6265 33.5053 36.0859 31.8011 53.4393 69.6411 3.4488 0.2513 11.7650 30.9579 66.1874 77.8088 1.6133 5.7730 7.9330 39.0321 23.4308 32.7937 20.0056 179.8818 7.7614 50.1772 4.9693 42.3390 9.2482 16.3628 384.1754 109.6210 11.9790 15.2862 40.9205 70.2468 34.0394 303.6458 209.2344 6.0574 72.3632 21.5844 19.3884 27.6988 4.7554 31.6738 40.4121 3.8904 0.6652 8.8518 11.9974 0.8067 0.3366 10.0657 1.5235 200.4697
temp: 298.150 k
press: 1.00000 atm
elementType: 17 9 8 8 8 8 7 7 7 6 6 6 6 6 6 6 6 6 6 6 6 6 6 6 6 6 6 6 6 1 1 1 1 1 1 1 1 1 1 1 1 1 1 1 1 1
symmnumber: 1
zpe: 880882.0 jmol-1
zpe.correction: 0.335510 hartree
zpe.thermalcorrener: 0.362851 hartree
zpe.thermalcorrenthalpy: 0.363796 hartree
zpe.thermalcorrgfe: 0.272909 hartree
zpe.sumelectzpe: -1795.325625 hartree
zpe.sumelectthermal: -1795.298284 hartree
zpe.sumelectthermalent: -1795.297340 hartree
zpe.sumelectthermalfe: -1795.388227 hartree
dipole: -0.2355 2.5424 0.3158
dipole: 2.5727
quadrupole: -148.1799 -179.2505 -164.9752
quadrupole: -17.0738 -12.6955 -4.2911
quadrupole: 15.9553 -15.1153 -0.8400 -17.0738 -12.6955 -4.2911
hfenergy: -1795.6611354 hartree
pointgroup: C01 [X(C20H17Cl1F1N3O4)]
dipole: -0.3105233 -0.9492204 -0.1645734 debye
polarizability: 320.5890435|-3.6772761|268.3267107|-10.7659491|19.0246377|221.4431354 unknown
InChI: InChI=1S/C20H17ClFN3O4/c1-3-29-19(27)17-18(26)25(20(28)23-2)15-9-8-11(21)10-13(15)16(24-17)12-6-4-5-7-14(12)22/h4-10,17,23H,3H2,1-2H3
charge 0 multiplicity 1
46 atoms
Cl 2.890496 -2.910299 -3.494789
F  2.230748 3.173543 -0.213265
O  -3.226098 2.03738 -1.448767
O  -2.965922 0.334263 1.257455
O  -2.121431 3.374215 0.11776
O  -1.016288 -3.382418 1.465659
N  -1.391062 -1.246708 0.485802
N  -0.008158 1.415917 0.156706
N  -2.7363 -2.048857 2.319533
C  0.795492 -0.782483 -0.662598
C  -0.375401 -1.579066 -0.497285
C  -1.325416 1.068102 -0.419235
C  0.962108 0.533533 0.031264
C  -1.997657 0.028042 0.503205
C  2.303512 0.869277 0.592473
C  1.795421 -1.210182 -1.579029
C  -0.536536 -2.766313 -1.251626
C  -2.22527 2.310326 -0.512555
C  -1.703471 -2.324777 1.469483
C  1.608097 -2.388415 -2.314088
C  0.448164 -3.177421 -2.167818
C  2.874676 2.164534 0.515556
C  3.053317 -0.123901 1.282651
C  4.109283 2.488103 1.103026
C  4.291329 0.176198 1.886504
C  4.818447 1.486408 1.801221
C  -4.277749 3.090904 -1.601156
C  -3.119027 -2.991491 3.377492
C  -5.286358 2.565156 -2.616507
H  -1.24805 0.623574 -1.435075
H  2.697821 -0.607412 -1.712492
H  -1.428653 -3.379361 -1.105928
H  0.319992 -4.093377 -2.750746
H  2.640738 -1.135726 1.357794
H  -3.203017 -1.130725 2.222087
H  4.497344 3.505849 1.003046
H  4.83909 -0.60455 2.423255
H  5.778582 1.728759 2.268259
H  -3.78528 4.022653 -1.933275
H  -4.726486 3.270775 -0.607745
H  -2.994851 -2.530052 4.374038
H  -4.17313 -3.301273 3.258335
H  -2.473963 -3.880867 3.311833
H  -5.745261 1.625518 -2.264614
H  -4.804582 2.375693 -3.591016
H  -6.089241 3.310152 -2.764926
