program: Gaussian 09
title: 000073825
version: EM64L-G09RevD.01
frameworkgroup: C1[X(C5H6N2O2)]
method: RPBEPBE
basis: SDD
operation: Freq
keyword: #pfreq=noraman
keyword: PBEPBE/SDD
title: #p freq=noraman PBEPBE/SDD
converged: NO YES NO YES
title: Mulliken charges:
elementType: O O N N C C C C C H H H H H H
charge: -0.395521 -0.273193 -0.404224 -0.034403 0.333072 -0.076802 -0.731401 -0.231908 0.128192 0.312601 0.265669 0.265781 0.202823 0.263037 0.376276
chargesum: 0.00000
title: Mulliken charges with hydrogens summed into heavy atoms:
elementType: O O N N C C C C C
charge: -0.019244 -0.273193 -0.091623 -0.034403 0.333072 -0.076802 0.002872 0.031129 0.128192
polarizability: 9.63181023e+01 1.85754977e+00 8.32480311e+01 2.43682055e-03 7.77172094e-04 3.60581871e+01
1716.lowfreq: -47.5476 -4.6421 -0.0011 -0.0009 -0.0008 3.6207 13.1492 67.9196 171.8911
frequency: -46.3471 67.8565 171.8906 180.4990 255.8478 301.3532 414.5068 495.5940 568.3111 635.3201 642.1169 663.1888 686.0798 691.6199 758.0219 788.1899 905.4607 973.0266 1016.6943 1040.6051 1074.3695 1135.4229 1209.7437 1245.5695 1318.7952 1346.6043 1402.2316 1412.8386 1447.4298 1452.1161 1482.5514 1561.6491 1624.5429 2991.9309 3083.0755 3089.3910 3239.7762 3515.0420 3576.4596
redmass: 1.0216 8.1682 4.8989 5.1993 3.4962 3.8057 7.1326 5.2487 1.3698 3.4304 4.9865 3.2996 1.1582 4.5843 6.6564 1.4816 6.8182 1.7459 3.4775 1.4701 1.7623 3.1013 2.2195 1.9589 2.3560 3.5640 6.1820 1.2223 1.0420 2.0950 1.4425 6.0200 7.6794 1.0369 1.0971 1.1002 1.0990 1.0639 1.0819
irintensity: 0.1622 4.0269 5.1659 13.9440 4.2884 5.8362 10.1303 3.4244 69.6944 0.0469 34.2076 120.8977 83.0635 13.6723 13.4479 21.3225 38.0863 20.6941 270.9319 6.8576 9.0060 46.9285 17.2438 13.0548 41.3320 18.2215 42.5171 11.1546 15.7972 73.7898 5.8963 83.2505 254.0182 19.3492 5.7253 18.9122 1.3447 38.1370 41.3387
temp: 298.150 k
press: 1.00000 atm
elementType: 8 8 7 7 6 6 6 6 6 1 1 1 1 1 1
symmnumber: 1
zpe: 289889.4 jmol-1
zpe.correction: 0.110413 hartree
zpe.thermalcorrener: 0.117953 hartree
zpe.thermalcorrenthalpy: 0.118897 hartree
zpe.thermalcorrgfe: 0.077870 hartree
zpe.sumelectzpe: -453.426497 hartree
zpe.sumelectthermal: -453.418957 hartree
zpe.sumelectthermalent: -453.418013 hartree
zpe.sumelectthermalfe: -453.459040 hartree
dipole: -4.4486 1.8766 -0.0006
dipole: 4.8282
quadrupole: -34.8336 -57.3070 -53.0939
quadrupole: -3.1494 0.0011 0.0055
quadrupole: 13.5779 -8.8955 -4.6824 -3.1494 0.0011 0.0055
hfenergy: -453.5369099 hartree
pointgroup: C01 [X(C5H6N2O2)]
dipole: -1.7161521 0.8143636 -0.0002517 debye
dipolederiv: -0.7807855 0.5658311 -0.0001945 0.6370685 -0.8318943 0.000065 0.0003772 -0.0007098 -0.4110045 -0.8736741 -0.212634 -0.0000961 -0.2355369 -0.9061246 -0.0003467 0.0004446 0.0008344 -0.3403922 -0.6288879 0.0677117 -0.0000165 -0.0869326 -0.2609641 0.0000136 0.0000303 -0.0000685 -0.2332772 -0.1927718 0.0615945 -0.0000319 0.1929847 -0.3151072 -0.0000017 -0.0002234 0.0000509 -0.2314837 0.6030585 -0.0862281 0.0000461 -0.1177495 0.2696999 0.0000204 -0.0001411 0.0002366 0.0301639 -0.707162 0.1520713 0.0000783 0.011979 -0.0805493 0.0001011 -0.0002887 0.000012 -0.0592352 0.1275174 -0.0984358 0.0001035 -0.0252343 -0.1496086 0.0000037 0.0001781 -0.0001475 0.0363199 0.0624955 -0.1704122 0.0001348 -0.0756851 0.3022273 0.0000182 0.0000355 -0.0000323 -0.0944159 1.9686584 -0.2562686 0.0000414 -0.1553454 1.392262 0.0001067 -0.0004701 -0.000191 0.2491642 0.2046542 0.0377438 -0.000049 0.0377769 0.1657867 0.0000194 -0.0000639 0.0000203 0.3463263 0.0677617 -0.0187104 -0.0834576 0.0043228 0.042332 -0.0217129 -0.0622275 -0.0626803 -0.0024459 0.0676193 -0.0188716 0.0835546 0.0042411 0.0425586 0.0216664 0.062323 0.0625517 -0.0020018 -0.135812 0.1373767 -0.0002205 0.0410926 0.0162347 0.0000143 -0.0001968 0.0000805 0.1212158 0.0056901 -0.0526179 -0.0000605 -0.0512587 0.0598659 -0.0000445 -0.0000343 -0.0000304 0.1994339 0.211638 -0.1081506 0.000168 -0.1817232 0.2532811 0.000077 0.000257 0.0000732 0.3916325 unknown
polarizability: 96.4557687|1.2775873|83.1103647|0.0024686|0.0006695|36.0581871 unknown
InChI: InChI=1S/C5H6N2O2/c1-3-4(5(8)9)7-2-6-3/h2,6,8H,1H3
charge 0 multiplicity 1
15 atoms
O  2.321835 -1.152437 0.000317
O  2.049276 1.154912 -0.000285
N  -2.097398 0.038528 0.000113
N  -0.490744 -1.553077 0.000566
C  -0.894004 0.741525 0.000424
C  0.095144 -0.267794 0.000844
C  -0.806477 2.237863 0.000627
C  -1.810844 -1.333608 0.000024
C  1.535577 0.000054 0.001379
H  -3.025399 0.462225 -0.000165
H  -0.246796 2.594991 0.882299
H  -0.245159 2.595142 -0.879929
H  -1.807087 2.706521 -0.000238
H  -2.581947 -2.100319 -0.000336
H  3.277124 -0.871125 -0.000641
