program: Gaussian 09
title: 000068851
version: EM64L-G09RevD.01
frameworkgroup: C1[X(C16H19ClN4O2S)]
method: RPBEPBE
basis: SDD
operation: Freq
keyword: #p
keyword: freq=noraman
keyword: PBEPBE/SDD
title: #p freq=noraman PBEPBE/SDD
converged: YES YES NO NO
title: Mulliken charges:
elementType: Cl S O O N N N N C C C C C C C C C C C C C C C C H H H H H H H H H H H H H H H H H H H
charge: -0.021763 0.316023 -0.479051 -0.276929 -0.474333 -0.348190 -0.091503 0.095073 0.114553 0.317145 0.366361 -0.369391 -0.446673 -0.879596 -0.221772 -0.837860 0.314553 -0.357589 -0.327720 -0.795719 -0.404456 0.273334 -0.293033 -0.167245 0.258430 0.234260 0.310910 0.255859 0.214016 0.294317 0.231438 0.234185 0.232071 0.232713 0.230498 0.246893 0.259327 0.292262 0.292401 0.405899 0.218302 0.199164 0.352832
chargesum: 0.00000
title: Mulliken charges with hydrogens summed into heavy atoms:
elementType: Cl S O O N N N N C C C C C C C C C C C C C C C C
charge: -0.021763 0.316023 -0.126218 -0.276929 -0.163423 0.057710 -0.091503 0.095073 0.114553 0.317145 0.366361 -0.110960 -0.212413 -0.115403 0.009666 -0.138891 0.314553 0.119802 -0.068393 -0.211056 -0.404456 0.273334 0.124433 -0.167245
polarizability: 3.19502663e+02 -1.51919123e+01 2.46551868e+02 4.94390639e+00 -3.47675654e+01 1.75197286e+02
1716.lowfreq: -9.3250 -3.0215 0.0009 0.0026 0.0028 6.2572 19.3400 25.3906 31.8157
frequency: 18.5812 24.9184 31.7680 46.5204 52.2478 55.0321 68.2103 75.1357 109.6270 117.2248 138.2077 143.8591 153.1650 158.3330 165.5686 182.9508 197.1616 206.9780 225.2124 240.1782 250.1765 258.8261 277.4079 309.8168 321.6461 328.2641 387.2672 394.8489 420.2798 429.9570 464.5079 489.2919 501.3631 503.1431 521.6340 552.7012 561.2965 573.3900 582.1053 629.9313 636.4807 648.9579 709.7309 737.7733 738.8091 747.1604 783.0716 789.9406 794.1899 808.7962 811.3993 824.5477 860.9708 883.0437 897.2370 901.5964 917.3974 942.2654 961.0828 972.5493 994.0330 1033.7772 1035.6797 1055.3837 1060.3036 1071.7250 1097.3695 1098.8804 1105.0348 1159.5800 1181.5396 1192.8240 1200.0251 1215.5492 1225.6644 1239.6990 1256.9392 1265.8646 1272.7622 1285.2370 1290.4744 1317.7631 1360.4953 1365.9345 1390.1620 1397.6308 1403.0367 1412.7638 1418.0010 1424.4416 1442.8624 1453.7818 1459.1637 1467.9352 1468.9070 1482.7797 1490.7850 1494.8692 1523.9368 1549.0526 1553.8986 1598.7425 1612.1248 1627.0661 2949.8647 2959.9827 2974.9775 2998.3317 3030.6264 3031.2649 3048.8074 3050.9299 3075.5530 3085.6631 3105.6004 3128.4518 3140.2447 3149.7573 3173.8632 3184.4403 3320.6811 3538.2924 3575.3804
redmass: 4.5898 5.4291 5.8194 5.6313 7.1148 5.4388 4.4628 5.1492 3.6109 3.2145 2.3244 2.1320 3.0654 4.1502 6.9811 1.1093 5.6746 8.7256 4.4769 2.9769 1.5368 3.1925 4.9866 3.3148 2.1944 2.7183 7.5863 3.1577 7.1978 4.7974 3.0950 2.9531 3.0020 3.6332 2.0963 3.3541 4.7035 5.6281 4.1508 6.6513 5.8011 5.6067 3.4021 3.2689 6.1309 3.0633 2.6873 2.2797 2.2055 1.3941 4.4510 1.7382 2.4624 2.8400 2.2912 1.5055 9.1499 2.7867 3.1420 1.3618 1.4576 1.5647 2.5071 1.6380 1.7674 2.0405 1.9190 2.0821 2.1034 1.2436 1.2091 3.2649 1.2524 1.1583 3.6488 1.3771 2.4280 2.1192 2.4038 3.0651 1.1708 4.6065 1.3303 5.4046 1.3851 1.2813 1.2511 1.3205 2.7183 2.1037 1.1050 2.4945 1.5506 1.0901 1.0741 1.8347 1.1762 1.0603 2.0456 3.5285 3.5868 6.3717 5.6697 6.1629 1.0451 1.0569 1.0380 1.0661 1.0986 1.0968 1.0587 1.0973 1.1004 1.0980 1.0940 1.0872 1.1061 1.0931 1.0976 1.0943 1.0829 1.0757 1.0665
irintensity: 0.0862 0.1462 0.4148 5.1022 1.1193 0.6225 1.2640 0.5285 1.3754 2.7443 2.4367 2.1203 1.1700 1.2768 3.9580 2.3281 2.3102 3.7423 0.7912 16.7611 104.8281 6.2079 29.9059 9.6646 10.7374 1.9288 2.8932 8.6526 4.4668 3.2107 7.6615 5.4738 7.0312 0.7670 41.6902 17.0246 7.3929 20.5308 26.4819 3.1677 7.7877 0.7921 3.7627 23.0029 1.1908 33.6061 73.0670 26.4529 72.0292 40.6048 33.2449 51.7026 20.1611 15.9078 1.2192 2.9470 15.8660 19.8517 10.5196 0.8363 5.7693 1.7742 49.8892 1.7389 3.0128 14.8754 4.3756 7.6773 123.2522 13.3265 2.2644 5.9647 5.1535 5.5183 185.6681 8.6465 56.4877 8.5940 41.4224 17.1078 15.4253 42.5378 2.7080 25.1136 8.5466 9.9411 23.9181 26.3039 208.5950 11.9933 15.7357 69.6100 64.0482 15.6196 13.8431 66.1427 72.3199 8.4078 97.6134 396.0414 966.1487 10.5543 32.4387 269.0028 36.7285 71.6417 32.6255 14.8931 27.2935 42.0335 7.3996 20.0974 9.3007 20.9545 16.6424 6.6844 0.5502 23.0085 8.3525 0.7983 264.2726 49.4087 5.0534
temp: 298.150 k
press: 1.00000 atm
elementType: 17 16 8 8 7 7 7 7 6 6 6 6 6 6 6 6 6 6 6 6 6 6 6 6 1 1 1 1 1 1 1 1 1 1 1 1 1 1 1 1 1 1 1
symmnumber: 1
zpe: 867968.1 jmol-1
zpe.correction: 0.330592 hartree
zpe.thermalcorrener: 0.355447 hartree
zpe.thermalcorrenthalpy: 0.356391 hartree
zpe.thermalcorrgfe: 0.273610 hartree
zpe.sumelectzpe: -1846.927170 hartree
zpe.sumelectthermal: -1846.902315 hartree
zpe.sumelectthermalent: -1846.901371 hartree
zpe.sumelectthermalfe: -1846.984151 hartree
dipole: -5.0521 -5.7947 1.8112
dipole: 7.8982
quadrupole: -165.4318 -168.8069 -140.1573
quadrupole: 1.9363 0.1865 -5.6876
quadrupole: -7.2998 -10.6749 17.9747 1.9363 0.1865 -5.6876
hfenergy: -1847.2577615 hartree
pointgroup: C01 [X(C16H19Cl1N4O2S1)]
dipole: -2.7775681 -0.9942318 0.9760034 debye
polarizability: 273.4469226|-35.2078135|290.2012267|-41.6782881|1.6628869|177.6036676 unknown
InChI: InChI=1S/C16H19ClN4O2S/c1-10-4-3-5-12(11(10)2)19-14-8-13(17)20-16(21-14)24-9-15(23)18-6-7-22/h3-5,8,18-19,22H,6-7,9H2,1-2H3
charge 0 multiplicity 1
43 atoms
Cl 2.929244 -4.800565 -1.289024
S  3.433916 0.53265 -1.444029
O  0.476604 -0.582331 2.614793
O  2.501269 3.4170 0.687496
N  -1.151481 -1.625612 -0.61761
N  0.996399 1.621684 0.751356
N  0.985588 -0.677669 -1.036092
N  2.938756 -2.092096 -1.340593
C  -2.826825 -0.180496 0.449457
C  -1.902726 -0.40159 -0.614671
C  -3.63541 0.994934 0.418677
C  -1.769721 0.517588 -1.682659
C  -3.48454 1.914821 -0.649685
C  -2.888534 -1.175857 1.597067
C  -2.555971 1.68463 -1.688384
C  -4.644079 1.292087 1.517469
C  0.193727 -1.789954 -0.879614
C  0.603131 1.794897 2.149799
C  0.757133 -3.104967 -0.956533
C  2.242657 2.010091 -1.309758
C  2.310416 -0.881432 -1.25489
C  1.9357 2.420184 0.137887
C  1.135993 0.672603 3.047075
C  2.138276 -3.161854 -1.186539
H  -1.064683 0.310859 -2.492001
H  -4.101825 2.820394 -0.664395
H  -1.646201 -2.462109 -0.302319
H  -3.564598 -0.837387 2.396619
H  -3.257599 -2.171805 1.273614
H  -1.881376 -1.307199 2.036711
H  -2.457437 2.404873 -2.507532
H  -5.197128 2.220815 1.297957
H  -5.385778 0.479047 1.62872
H  -4.154628 1.421997 2.501666
H  -0.500641 1.822716 2.22668
H  1.006014 2.763714 2.494777
H  0.151059 -4.006155 -0.848319
H  1.332607 1.741638 -1.869617
H  2.781631 2.828606 -1.808813
H  0.656359 0.801245 0.221656
H  2.235896 0.595973 2.936105
H  0.886007 0.890623 4.106409
H  0.955703 -1.354894 3.005985
