program: Gaussian 09
title: 000073824
version: EM64L-G09RevD.01
frameworkgroup: C1[X(C5H6N2O2)]
method: RPBEPBE
basis: SDD
operation: Freq
keyword: #pfreq=noraman
keyword: PBEPBE/SDD
title: #p freq=noraman PBEPBE/SDD
converged: NO NO NO NO
title: Mulliken charges:
elementType: O O N N C C C C C H H H H H H
charge: -0.416689 -0.273330 -0.432960 -0.095353 0.225259 0.288484 -0.362969 -0.763642 0.080597 0.337518 0.278533 0.237668 0.237712 0.272120 0.387052
chargesum: 0.00000
title: Mulliken charges with hydrogens summed into heavy atoms:
elementType: O O N N C C C C C
charge: -0.029637 -0.273330 -0.095442 -0.095353 0.225259 0.288484 -0.084436 -0.016142 0.080597
polarizability: 1.10958434e+02 -1.90569163e+00 7.69780879e+01 4.25960893e-03 7.35656608e-04 3.59644481e+01
1716.lowfreq: -7.1739 -0.0013 -0.0011 -0.0010 0.9410 6.2403 70.9558 95.9386 142.4780
frequency: 70.9464 95.9377 142.4764 143.9233 286.3848 320.0802 388.0692 509.7895 545.0020 617.3194 627.0485 671.2143 700.5079 725.7863 731.4652 867.5566 946.5948 973.4037 986.5455 1047.9189 1058.8895 1151.6848 1197.5875 1255.8170 1308.8605 1348.4653 1383.8650 1402.7492 1470.1505 1471.1260 1489.7410 1535.9552 1650.6908 2988.6542 3064.8948 3126.2450 3246.4682 3533.7359 3565.7556
redmass: 1.1184 4.3749 5.2983 5.0743 3.9865 3.4428 5.7428 6.0321 1.3204 2.6609 4.2069 4.8835 4.7147 2.7486 1.5202 1.4548 4.2964 1.6715 6.1758 1.4972 2.5472 1.6552 1.9530 1.8961 2.7532 3.8961 5.0296 1.3395 1.0437 1.1219 8.4928 4.3356 8.0483 1.0391 1.0981 1.0967 1.0996 1.0643 1.0818
irintensity: 0.6148 3.7042 5.2759 0.0461 2.0891 0.3879 22.8186 9.8765 139.9782 15.6387 26.2947 7.5231 2.4243 105.3148 30.0104 30.1296 59.7406 39.7923 24.0071 6.6521 198.0745 152.5287 23.2799 41.5455 12.5334 52.6251 24.4038 10.5729 18.5144 8.2827 168.3494 15.7752 414.9753 22.1906 15.9705 4.1832 0.7747 57.2748 62.0967
temp: 298.150 k
press: 1.00000 atm
elementType: 8 8 7 7 6 6 6 6 6 1 1 1 1 1 1
symmnumber: 1
zpe: 290987.5 jmol-1
zpe.correction: 0.110831 hartree
zpe.thermalcorrener: 0.119164 hartree
zpe.thermalcorrenthalpy: 0.120108 hartree
zpe.thermalcorrgfe: 0.077153 hartree
zpe.sumelectzpe: -453.434388 hartree
zpe.sumelectthermal: -453.426055 hartree
zpe.sumelectthermalent: -453.425111 hartree
zpe.sumelectthermalfe: -453.468067 hartree
dipole: -0.5782 -1.7999 0.0000
dipole: 1.8905
quadrupole: -43.9925 -55.7563 -53.0232
quadrupole: 11.1817 0.0153 0.0027
quadrupole: 6.9315 -4.8323 -2.0992 11.1817 0.0153 0.0027
hfenergy: -453.5452194 hartree
pointgroup: C01 [X(C5H6N2O2)]
dipole: -0.189268 0.719304 -0.0000552 debye
dipolederiv: -0.9842721 0.4832116 -0.00001 0.6909362 -0.7255144 -0.0002153 0.0029952 -0.0026119 -0.4304685 -0.8770214 -0.228569 -0.0005992 -0.3635421 -1.0110949 -0.0020836 0.0021986 0.0023726 -0.3551814 -0.0693075 -0.0160915 0.0000128 -0.1278875 -0.5632617 -0.0000733 -0.0002257 -0.0000674 -0.2179668 -0.7269106 -0.0011555 -0.0001853 0.4273871 -0.4177653 0.0001887 0.0001024 0.0000698 -0.2783392 0.3989357 -0.0029518 0.0004508 -0.4811983 0.4927753 -0.0002094 0.0001002 -0.0000617 0.0369832 -1.0994881 -0.2833458 -0.0001594 -0.4402998 0.031848 -0.0002579 -0.0016316 -0.0006589 -0.0040237 0.5532996 0.0541901 0.0004545 0.170131 0.203635 0.000235 -0.0001607 -0.0001332 -0.1007244 -0.0952936 0.0268796 -0.000162 0.1624305 -0.0338694 0.0002419 -0.00035 0.00012 0.0865432 2.2306403 0.0537146 -0.0000618 0.0405879 1.4404155 0.002088 -0.0037223 0.0008324 0.2721337 0.2360213 -0.0392184 -0.0001625 0.0150092 0.2203529 0.0000437 -0.0000304 0.0000409 0.3409757 0.0862497 0.041275 -0.0000631 0.0689351 0.0438141 0.0000199 0.0000385 0.0001585 0.180115 0.0263479 0.0235602 -0.0187791 0.0669741 0.0275838 -0.1043406 0.0480429 -0.117452 -0.0329605 0.0265217 0.0234479 0.0188096 0.0668752 0.0278096 0.1043198 -0.0479366 0.1173866 -0.0331182 0.0231349 -0.0426633 -0.0000364 -0.1302671 0.0265507 -0.0000349 0.0000861 -0.0000052 0.1326811 0.2711422 -0.0922837 0.000491 -0.1660717 0.236721 0.0000779 0.0004935 0.0000095 0.4033507 unknown
polarizability: 111.0647889|0.0794682|76.8717313|0.0117844|-0.0007538|35.9644497 unknown
InChI: InChI=1S/C5H6N2O2/c1-3-6-2-4(7-3)5(8)9/h2,7-8H,1H3
charge 0 multiplicity 1
15 atoms
O  2.714147 -0.872737 -0.001367
O  2.266846 1.421635 -0.000477
N  -0.556096 0.818247 0.000338
N  -1.611374 -1.176368 -0.00049
C  -1.782049 0.178166 -0.000694
C  0.450602 -0.161848 0.001789
C  -0.235456 -1.388546 0.00048
C  -3.101552 0.883891 -0.001802
C  1.85028 0.230458 0.003806
H  -0.364716 1.82166 0.000602
H  0.192153 -2.387713 0.00082
H  -3.228263 1.523513 0.891055
H  -3.227169 1.522755 -0.89536
H  -3.900332 0.127483 -0.001983
H  3.651878 -0.541395 -0.004517
