program: Gaussian 09
title: 000073827
version: EM64L-G09RevD.01
frameworkgroup: C1[X(C6H7ClN4O2)]
method: RPBEPBE
basis: SDD
operation: Freq
keyword: #p
keyword: freq=noraman
keyword: PBEPBE/SDD
title: #p freq=noraman PBEPBE/SDD
converged: YES YES NO NO
title: Mulliken charges:
elementType: Cl O O N N N N C C C C C C H H H H H H H
charge: -0.065752 -0.240121 -0.320146 -0.073408 0.175748 -0.626932 -0.608969 -0.105548 0.141654 0.285989 -0.391586 0.237170 -0.500330 0.382087 0.322069 0.335373 0.334138 0.238797 0.239925 0.239842
chargesum: 0.00000
title: Mulliken charges with hydrogens summed into heavy atoms:
elementType: Cl O O N N N N C C C C C C
charge: -0.065752 -0.240121 -0.320146 -0.073408 0.175748 0.077223 0.060542 -0.105548 0.141654 0.285989 -0.391586 0.237170 0.218235
polarizability: 1.91002174e+02 -4.95378567e+00 1.30473546e+02 5.37178920e-02 -1.00756007e-02 4.80128832e+01
1716.lowfreq: -0.0023 -0.0016 -0.0015 1.7988 5.8429 7.2877 52.0378 83.2533 105.0343
frequency: 52.0311 83.2451 105.0317 113.2439 124.0367 176.0459 231.1896 245.3164 293.4575 316.3509 343.0912 351.8827 359.7397 412.2215 471.7439 529.4339 541.5810 557.1424 571.4919 587.7012 658.6587 664.8483 704.5002 709.8892 751.6466 782.9140 788.4426 901.4163 973.1009 1028.0165 1084.5604 1112.5774 1148.4585 1160.9715 1245.6672 1306.8150 1382.5435 1427.1602 1435.9888 1452.2093 1460.2738 1465.5800 1482.2075 1552.4086 1577.7697 1595.2002 1624.4109 3003.3675 3103.8725 3151.3059 3390.2803 3531.9377 3637.2762 3686.2139
redmass: 5.0436 1.4779 4.3630 2.8077 5.4047 5.3103 6.0911 8.3222 4.3588 5.9624 9.8476 6.6476 3.6627 6.9476 3.7956 1.1817 1.1284 3.5345 1.3898 9.8440 8.3575 9.4683 7.9060 11.2563 1.4339 6.9872 3.0833 7.2035 2.3861 3.4562 3.8662 1.2600 1.4885 2.3496 5.6199 6.0081 3.9925 2.5170 1.9186 1.0501 1.3978 2.1031 3.1979 2.9559 7.2120 1.6684 1.9609 1.0297 1.1044 1.1045 1.0554 1.0446 1.0960 1.1054
irintensity: 3.5712 1.0347 3.6666 3.8241 2.0021 0.0627 4.9610 4.9949 4.2294 4.2713 21.2748 2.5048 17.5363 7.1222 37.0020 139.4750 2.9523 3.3168 297.6393 6.3429 41.0545 0.3401 3.4130 2.2736 45.6227 9.9052 100.4607 2.3422 11.2406 144.2990 199.6090 0.0913 74.9811 7.8713 103.7315 326.6912 42.6925 43.1720 91.9272 14.1440 70.1868 47.9072 177.5530 34.0890 636.5867 114.5788 363.5007 44.8059 28.7000 15.0546 132.7053 141.7354 80.3747 54.5186
temp: 298.150 k
press: 1.00000 atm
elementType: 17 8 8 7 7 7 7 6 6 6 6 6 6 1 1 1 1 1 1 1
symmnumber: 1
zpe: 367543.5 jmol-1
zpe.correction: 0.139990 hartree
zpe.thermalcorrener: 0.152565 hartree
zpe.thermalcorrenthalpy: 0.153509 hartree
zpe.thermalcorrgfe: 0.100652 hartree
zpe.sumelectzpe: -1061.417441 hartree
zpe.sumelectthermal: -1061.404866 hartree
zpe.sumelectthermalent: -1061.403922 hartree
zpe.sumelectthermalfe: -1061.456778 hartree
dipole: 1.2215 2.6822 0.0028
dipole: 2.9473
quadrupole: -62.1679 -77.5098 -83.3335
quadrupole: 10.3604 0.0167 -0.0083
quadrupole: 12.1692 -3.1727 -8.9964 10.3604 0.0167 -0.0083
hfenergy: -1061.5574307 hartree
pointgroup: C01 [X(C6H7Cl1N4O2)]
dipole: -0.6135948 0.9833937 -0.0312662 debye
dipolederiv: -0.4754914 -0.3758311 0.0138275 -0.5081014 -0.7583687 0.023836 0.0179387 0.0232287 -0.0979132 -1.1553846 0.4325972 -0.0105164 1.0262843 -0.9990262 0.0188117 -0.0289249 0.0203941 -0.278731 -1.0594099 -0.2227732 0.0086788 -0.2426858 -0.8421251 0.0154324 0.0103208 0.0154768 -0.3492346 -0.8821103 -0.2759688 0.0084904 -0.3733746 -0.5983138 0.0099129 0.0125958 0.0094856 -0.3024944 0.3557978 -0.157361 0.0041027 0.6118999 -0.1556739 0.0002665 -0.0212682 0.0028215 -0.0936368 -0.4723553 -0.4724793 0.014672 -0.3994227 -1.2120796 0.0185207 0.011971 0.0175455 -0.6492087 -1.7383143 0.0264611 0.0003222 0.1757098 -0.2012368 -0.0171929 -0.0062879 -0.0165799 -0.6814747 -1.0385725 0.4303777 -0.0114339 -0.5155812 -0.5017279 0.0154804 0.0206141 0.0121763 -0.0560143 0.7001403 0.4326552 -0.0129213 0.3859218 1.3908363 -0.0368668 -0.0127272 -0.0353954 0.2294093 1.8873236 -0.0799881 0.001679 -0.5407695 0.3548151 0.0006283 0.0176908 -0.0015707 0.2905344 -0.1580158 0.6509007 -0.0222926 1.2651483 0.8855441 -0.0353185 -0.0432307 -0.0326703 -0.04042 2.2418653 -0.2474026 0.0018673 -0.667218 1.3569178 -0.0312568 0.0136197 -0.0325089 0.2435746 0.7654185 -0.2320914 0.0054092 -0.1875864 0.3013844 0.0000141 0.0043598 -0.0001358 0.2842581 0.3633411 -0.044325 0.0011779 -0.007071 0.3272403 0.001314 0.000071 0.0016008 0.3684617 0.1545553 0.0382779 -0.0009114 0.0337786 0.2570538 0.0035041 -0.0007377 0.0035632 0.3720856 0.3280397 0.0010047 -0.000027 0.0508367 0.2083167 0.0058896 -0.0008225 0.0059902 0.3773681 0.2601331 -0.025878 0.0011103 -0.0963882 0.1612168 0.0076535 0.0039525 0.0074081 0.3799501 0.0486165 0.0271422 -0.0005612 0.1035748 -0.1052768 0.0072542 -0.0031399 0.0074928 0.1216213 -0.0629355 0.0457972 -0.0418697 -0.060495 0.0603575 -0.0996787 -0.0781763 -0.0585112 -0.0535651 -0.0626417 0.0488846 0.0391962 -0.0544602 0.0701461 0.0917953 0.0821809 0.0501888 -0.0645704 unknown
polarizability: 188.7036221|12.5638627|132.679855|-0.7884026|-2.7794716|48.1051256 unknown
InChI: InChI=1S/C6H7ClN4O2/c1-13-6(12)2-4(8)11-5(9)3(7)10-2/h8-9H2,1H3
charge 0 multiplicity 1
20 atoms
Cl -2.564132 -2.571945 0.119522
O  2.47332 -1.316251 0.057358
O  2.730358 0.996287 -0.013546
N  -1.550636 1.399178 -0.016973
N  -0.253655 -1.096011 0.062434
N  0.503882 2.511477 -0.054716
N  -3.632981 0.317042 0.020785
C  0.502651 0.046366 0.021632
C  -0.177715 1.32966 -0.017673
C  -2.266633 0.24492 0.022017
C  -1.560765 -1.016514 0.063875
C  1.970644 -0.027448 0.020019
C  3.951499 -1.41971 0.056784
H  1.531527 2.469595 -0.0549
H  -0.026639 3.380154 -0.080927
H  -4.189517 -0.535137 0.052119
H  -4.075592 1.233342 -0.009847
H  4.149598 -2.499711 0.092125
H  4.373669 -0.906741 0.937395
H  4.368316 -0.966653 -0.858582
